BDBM50194307 5-(4-(4-(4-(2-fluorophenyl)oxazol-2-yl)phenoxy)phenoxy)-5-(2-methoxyethyl)pyrimidine-2,4,6(1H,3H,5H)-trione::CHEMBL376859
SMILES: COCCC1(Oc2ccc(Oc3ccc(cc3)-c3nc(co3)-c3ccccc3F)cc2)C(=O)NC(=O)NC1=O
InChI Key: InChIKey=GVNHCTDFGAQJEV-UHFFFAOYSA-N
Data: 1 IC50
Activity Spreadsheet -- Enzyme Inhibition Constant Data from BindingDB
Found 1 hit for monomerid = 50194307
Trg + Lig
Ki
nM
ΔG°
kcal/mole
IC50
nM
Kd
nM
EC50/IC50
nM
koff
s-1
kon
M-1s-1
pHTemp
°C
Collagenase 3
(Homo sapiens (Human))
BDBM50194307
(5-(4-(4-(4-(2-fluorophenyl)oxazol-2-yl)phenoxy)phe...)
Show SMILES COCCC1(Oc2ccc(Oc3ccc(cc3)-c3nc(co3)-c3ccccc3F)cc2)C(=O)NC(=O)NC1=O
Show InChI InChI=1S/C28H22FN3O7/c1-36-15-14-28(25(33)31-27(35)32-26(28)34)39-20-12-10-19(11-13-20)38-18-8-6-17(7-9-18)24-30-23(16-37-24)21-4-2-3-5-22(21)29/h2-13,16H,14-15H2,1H3,(H2,31,32,33,34,35)
NCI pathway
Reactome pathway
n/an/a 1.40n/an/an/an/an/an/a
Pfizer Global Research & Development
Curated by ChEMBL
Assay Description
Inhibition of MMP13
Bioorg Med Chem Lett 16: 5822-6 (2006)
Article DOI: 10.1016/j.bmcl.2006.08.066
BindingDB Entry DOI: 10.7270/Q27P8Z1R