BDBM50194759 CHEMBL3983725
SMILES: CNCCN1CCC(CC1)OCc1cccc(Br)c1
InChI Key: InChIKey=SIOCLBFQLPHPJM-UHFFFAOYSA-N
Data: 2 IC50
Activity Spreadsheet -- Enzyme Inhibition Constant Data from BindingDB
Found 2 hits for monomerid = 50194759
Trg + Lig
Ki
nM
ΔG°
kcal/mole
IC50
nM
Kd
nM
EC50/IC50
nM
koff
s-1
kon
M-1s-1
pHTemp
°C
Protein arginine N-methyltransferase 6
(Homo sapiens (Human))
BDBM50194759
(CHEMBL3983725)
Show SMILES CNCCN1CCC(CC1)OCc1cccc(Br)c1
Show InChI InChI=1S/C15H23BrN2O/c1-17-7-10-18-8-5-15(6-9-18)19-12-13-3-2-4-14(16)11-13/h2-4,11,15,17H,5-10,12H2,1H3
n/an/a 53n/an/an/an/an/an/a
Icahn School of Medicine at Mount Sinai
Curated by ChEMBL
Assay Description
Inhibition of human full length PRMT6 (1 to 375 residues) expressed in baculovirus expression system assessed as inhibition of methylation activity p...
J Med Chem 59: 9124-9139 (2016)
Article DOI: 10.1021/acs.jmedchem.6b01033
BindingDB Entry DOI: 10.7270/Q2028TGJ
Histone-arginine methyltransferase CARM1
(Homo sapiens (Human))
BDBM50194759
(CHEMBL3983725)
Show SMILES CNCCN1CCC(CC1)OCc1cccc(Br)c1
Show InChI InChI=1S/C15H23BrN2O/c1-17-7-10-18-8-5-15(6-9-18)19-12-13-3-2-4-14(16)11-13/h2-4,11,15,17H,5-10,12H2,1H3
n/an/a 17n/an/an/an/an/an/a
Icahn School of Medicine at Mount Sinai
Curated by ChEMBL
Assay Description
Inhibition of human full length PRMT4 (1 to 608 residues) expressed in 293F cells assessed as inhibition of methylation activity preincubated with pr...
J Med Chem 59: 9124-9139 (2016)
Article DOI: 10.1021/acs.jmedchem.6b01033
BindingDB Entry DOI: 10.7270/Q2028TGJ