null
SMILES: CNCCN1CCC(CCc2ccccc2)CC1
InChI Key: InChIKey=VZZSAYLJCKTKMS-UHFFFAOYSA-N
Activity Spreadsheet -- Enzyme Inhibition Constant Data from BindingDB
Found 2 hits for monomerid = 50194762
Trg + Lig
Ki
nM
ΔG°
kcal/mole
IC50
nM
Kd
nM
EC50/IC50
nM
koff
s-1
kon
M-1s-1
pHTemp
°C
Histone-arginine methyltransferase CARM1
(Homo sapiens (Human))
BDBM50194762
(CHEMBL3892699)
Show SMILES CNCCN1CCC(CCc2ccccc2)CC1
Show InChI InChI=1S/C16H26N2/c1-17-11-14-18-12-9-16(10-13-18)8-7-15-5-3-2-4-6-15/h2-6,16-17H,7-14H2,1H3
n/an/a 108n/an/an/an/an/an/a
Icahn School of Medicine at Mount Sinai
Curated by ChEMBL
Assay Description
Inhibition of human full length PRMT4 (1 to 608 residues) expressed in 293F cells assessed as inhibition of methylation activity preincubated with pr...
J Med Chem 59: 9124-9139 (2016)
Article DOI: 10.1021/acs.jmedchem.6b01033
BindingDB Entry DOI: 10.7270/Q2028TGJ
Protein arginine N-methyltransferase 6
(Homo sapiens (Human))
BDBM50194762
(CHEMBL3892699)
Show SMILES CNCCN1CCC(CCc2ccccc2)CC1
Show InChI InChI=1S/C16H26N2/c1-17-11-14-18-12-9-16(10-13-18)8-7-15-5-3-2-4-6-15/h2-6,16-17H,7-14H2,1H3
n/an/a 56n/an/an/an/an/an/a
Icahn School of Medicine at Mount Sinai
Curated by ChEMBL
Assay Description
Inhibition of human full length PRMT6 (1 to 375 residues) expressed in baculovirus expression system assessed as inhibition of methylation activity p...
J Med Chem 59: 9124-9139 (2016)
Article DOI: 10.1021/acs.jmedchem.6b01033
BindingDB Entry DOI: 10.7270/Q2028TGJ