BDBM50194774 CHEMBL3930600
SMILES: CNCCN1CCC(CC1)OCc1ccc(OCC(F)(F)F)cc1
InChI Key: InChIKey=FPMCBNOZDJXPHM-UHFFFAOYSA-N
Data: 2 IC50
Activity Spreadsheet -- Enzyme Inhibition Constant Data from BindingDB
Found 2 hits for monomerid = 50194774
Trg + Lig
Ki
nM
ΔG°
kcal/mole
IC50
nM
Kd
nM
EC50/IC50
nM
koff
s-1
kon
M-1s-1
pHTemp
°C
Histone-arginine methyltransferase CARM1
(Homo sapiens (Human))
BDBM50194774
(CHEMBL3930600)
Show SMILES CNCCN1CCC(CC1)OCc1ccc(OCC(F)(F)F)cc1
Show InChI InChI=1S/C17H25F3N2O2/c1-21-8-11-22-9-6-16(7-10-22)23-12-14-2-4-15(5-3-14)24-13-17(18,19)20/h2-5,16,21H,6-13H2,1H3
n/an/a 53n/an/an/an/an/an/a
Icahn School of Medicine at Mount Sinai
Curated by ChEMBL
Assay Description
Inhibition of human full length PRMT4 (1 to 608 residues) expressed in 293F cells assessed as inhibition of methylation activity preincubated with pr...
J Med Chem 59: 9124-9139 (2016)
Article DOI: 10.1021/acs.jmedchem.6b01033
BindingDB Entry DOI: 10.7270/Q2028TGJ
Protein arginine N-methyltransferase 6
(Homo sapiens (Human))
BDBM50194774
(CHEMBL3930600)
Show SMILES CNCCN1CCC(CC1)OCc1ccc(OCC(F)(F)F)cc1
Show InChI InChI=1S/C17H25F3N2O2/c1-21-8-11-22-9-6-16(7-10-22)23-12-14-2-4-15(5-3-14)24-13-17(18,19)20/h2-5,16,21H,6-13H2,1H3
n/an/a 48n/an/an/an/an/an/a
Icahn School of Medicine at Mount Sinai
Curated by ChEMBL
Assay Description
Inhibition of human full length PRMT6 (1 to 375 residues) expressed in baculovirus expression system assessed as inhibition of methylation activity p...
J Med Chem 59: 9124-9139 (2016)
Article DOI: 10.1021/acs.jmedchem.6b01033
BindingDB Entry DOI: 10.7270/Q2028TGJ