BDBM50194975 2-methoxy-2-methyl-3-(6-(2-(5-methyl-2-phenyloxazol-4-yl)ethoxy)pyridin-3-yl)propanoic acid::CHEMBL221850
SMILES: COC(C)(Cc1ccc(OCCc2nc(oc2C)-c2ccccc2)nc1)C(O)=O
InChI Key: InChIKey=QQJHRCMKKXNPSH-UHFFFAOYSA-N
Data: 1 KI  3 EC50
Activity Spreadsheet -- Enzyme Inhibition Constant Data from BindingDB
Found 4 hits for monomerid = 50194975
Trg + Lig
Ki
nM
ΔG°
kcal/mole
IC50
nM
Kd
nM
EC50/IC50
nM
koff
s-1
kon
M-1s-1
pHTemp
°C
Peroxisome proliferator-activated receptor
(Homo sapiens (Human))
BDBM50194975
(2-methoxy-2-methyl-3-(6-(2-(5-methyl-2-phenyloxazo...)
Show SMILES COC(C)(Cc1ccc(OCCc2nc(oc2C)-c2ccccc2)nc1)C(O)=O
Show InChI InChI=1S/C22H24N2O5/c1-15-18(24-20(29-15)17-7-5-4-6-8-17)11-12-28-19-10-9-16(14-23-19)13-22(2,27-3)21(25)26/h4-10,14H,11-13H2,1-3H3,(H,25,26)
NCI pathway
Reactome pathway
560n/an/an/an/an/an/an/an/a
Pfizer Global R&D
Curated by ChEMBL
Assay Description
Displacement of radiolabeled darglitazone from human PPAR gamma by SPA binding assay
Bioorg Med Chem Lett 16: 6120-3 (2006)
Article DOI: 10.1016/j.bmcl.2006.08.110
BindingDB Entry DOI: 10.7270/Q20Z72XV
Peroxisome proliferator-activated receptor alpha (PPAR alpha)
(Homo sapiens (Human))
BDBM50194975
(2-methoxy-2-methyl-3-(6-(2-(5-methyl-2-phenyloxazo...)
Show SMILES COC(C)(Cc1ccc(OCCc2nc(oc2C)-c2ccccc2)nc1)C(O)=O
Show InChI InChI=1S/C22H24N2O5/c1-15-18(24-20(29-15)17-7-5-4-6-8-17)11-12-28-19-10-9-16(14-23-19)13-22(2,27-3)21(25)26/h4-10,14H,11-13H2,1-3H3,(H,25,26)
n/an/an/an/a 330n/an/an/an/a
Pfizer Global R&D
Curated by ChEMBL
Assay Description
Displacement of radiolabeled GW2331 from human PPAR alpha by SPA binding assay
Bioorg Med Chem Lett 16: 6120-3 (2006)
Article DOI: 10.1016/j.bmcl.2006.08.110
BindingDB Entry DOI: 10.7270/Q20Z72XV
Peroxisome proliferator-activated receptor
(Homo sapiens (Human))
BDBM50194975
(2-methoxy-2-methyl-3-(6-(2-(5-methyl-2-phenyloxazo...)
Show SMILES COC(C)(Cc1ccc(OCCc2nc(oc2C)-c2ccccc2)nc1)C(O)=O
Show InChI InChI=1S/C22H24N2O5/c1-15-18(24-20(29-15)17-7-5-4-6-8-17)11-12-28-19-10-9-16(14-23-19)13-22(2,27-3)21(25)26/h4-10,14H,11-13H2,1-3H3,(H,25,26)
NCI pathway
Reactome pathway
n/an/an/an/a 232n/an/an/an/a
Pfizer Global R&D
Curated by ChEMBL
Assay Description
Agonist activity at human PPAR gamma in a HepG2 cells by PPAR-GAL4 transactivation assay
Bioorg Med Chem Lett 16: 6120-3 (2006)
Article DOI: 10.1016/j.bmcl.2006.08.110
BindingDB Entry DOI: 10.7270/Q20Z72XV
Peroxisome proliferator-activated receptor alpha (PPAR alpha)
(Homo sapiens (Human))
BDBM50194975
(2-methoxy-2-methyl-3-(6-(2-(5-methyl-2-phenyloxazo...)
Show SMILES COC(C)(Cc1ccc(OCCc2nc(oc2C)-c2ccccc2)nc1)C(O)=O
Show InChI InChI=1S/C22H24N2O5/c1-15-18(24-20(29-15)17-7-5-4-6-8-17)11-12-28-19-10-9-16(14-23-19)13-22(2,27-3)21(25)26/h4-10,14H,11-13H2,1-3H3,(H,25,26)
n/an/an/an/a 144n/an/an/an/a
Pfizer Global R&D
Curated by ChEMBL
Assay Description
Agonist activity at human PPAR alpha in a HepG2 cells by PPAR-GAL4 transactivation assay
Bioorg Med Chem Lett 16: 6120-3 (2006)
Article DOI: 10.1016/j.bmcl.2006.08.110
BindingDB Entry DOI: 10.7270/Q20Z72XV