BDBM50194979 3,3-dimethyl-2-((6-(2-(5-methyl-2-phenyloxazol-4-yl)ethoxy)pyridin-3-yl)methyl)butanoic acid::CHEMBL221923
SMILES: Cc1oc(nc1CCOc1ccc(CC(C(O)=O)C(C)(C)C)cn1)-c1ccccc1
InChI Key: InChIKey=SQODDGQIFANIPN-UHFFFAOYSA-N
Data: 1 KI  1 EC50
Activity Spreadsheet -- Enzyme Inhibition Constant Data from BindingDB
Found 2 hits for monomerid = 50194979
Trg + Lig
Ki
nM
ΔG°
kcal/mole
IC50
nM
Kd
nM
EC50/IC50
nM
koff
s-1
kon
M-1s-1
pHTemp
°C
Peroxisome proliferator-activated receptor
(Homo sapiens (Human))
BDBM50194979
(3,3-dimethyl-2-((6-(2-(5-methyl-2-phenyloxazol-4-y...)
Show SMILES Cc1oc(nc1CCOc1ccc(CC(C(O)=O)C(C)(C)C)cn1)-c1ccccc1
Show InChI InChI=1S/C24H28N2O4/c1-16-20(26-22(30-16)18-8-6-5-7-9-18)12-13-29-21-11-10-17(15-25-21)14-19(23(27)28)24(2,3)4/h5-11,15,19H,12-14H2,1-4H3,(H,27,28)
NCI pathway
Reactome pathway
1.20E+4n/an/an/an/an/an/an/an/a
Pfizer Global R&D
Curated by ChEMBL
Assay Description
Displacement of radiolabeled darglitazone from human PPAR gamma by SPA binding assay
Bioorg Med Chem Lett 16: 6120-3 (2006)
Article DOI: 10.1016/j.bmcl.2006.08.110
BindingDB Entry DOI: 10.7270/Q20Z72XV
Peroxisome proliferator-activated receptor alpha (PPAR alpha)
(Homo sapiens (Human))
BDBM50194979
(3,3-dimethyl-2-((6-(2-(5-methyl-2-phenyloxazol-4-y...)
Show SMILES Cc1oc(nc1CCOc1ccc(CC(C(O)=O)C(C)(C)C)cn1)-c1ccccc1
Show InChI InChI=1S/C24H28N2O4/c1-16-20(26-22(30-16)18-8-6-5-7-9-18)12-13-29-21-11-10-17(15-25-21)14-19(23(27)28)24(2,3)4/h5-11,15,19H,12-14H2,1-4H3,(H,27,28)
n/an/an/an/a 9.40E+3n/an/an/an/a
Pfizer Global R&D
Curated by ChEMBL
Assay Description
Displacement of radiolabeled GW2331 from human PPAR alpha by SPA binding assay
Bioorg Med Chem Lett 16: 6120-3 (2006)
Article DOI: 10.1016/j.bmcl.2006.08.110
BindingDB Entry DOI: 10.7270/Q20Z72XV