BDBM50194981 6-(benzylamino)-4-(3-chloro-4-fluorophenylamino)quinoline-3-carbonitrile::CHEMBL373480
SMILES: Fc1ccc(Nc2c(cnc3ccc(NCc4ccccc4)cc23)C#N)cc1Cl
InChI Key: InChIKey=ALLXQJZPPUMVTC-UHFFFAOYSA-N
Data: 1 IC50
Activity Spreadsheet -- Enzyme Inhibition Constant Data from BindingDB
Found 1 hit for monomerid = 50194981
Trg + Lig
Ki
nM
ΔG°
kcal/mole
IC50
nM
Kd
nM
EC50/IC50
nM
koff
s-1
kon
M-1s-1
pHTemp
°C
Mitogen-activated protein kinase kinase kinase 8
(Homo sapiens (Human))
BDBM50194981
(6-(benzylamino)-4-(3-chloro-4-fluorophenylamino)qu...)
Show SMILES Fc1ccc(Nc2c(cnc3ccc(NCc4ccccc4)cc23)C#N)cc1Cl
Show InChI InChI=1S/C23H16ClFN4/c24-20-11-18(6-8-21(20)25)29-23-16(12-26)14-28-22-9-7-17(10-19(22)23)27-13-15-4-2-1-3-5-15/h1-11,14,27H,13H2,(H,28,29)
NCI pathway
Reactome pathway
n/an/a 210n/an/an/an/an/an/a
Wyeth Research
Curated by ChEMBL
Assay Description
Inhibition of Tpl2 kinase by ELISA
Bioorg Med Chem Lett 16: 6067-72 (2006)
Article DOI: 10.1016/j.bmcl.2006.08.102
BindingDB Entry DOI: 10.7270/Q2W958TR