BDBM50195009 4-(3-chloro-4-fluorophenylamino)-6-((4-methyl-1-(2-morpholinoethyl)-1H-imidazol-5-yl)methylamino)quinoline-3-carbonitrile::CHEMBL223088
SMILES: Cc1ncn(CCN2CCOCC2)c1CNc1ccc2ncc(C#N)c(Nc3ccc(F)c(Cl)c3)c2c1
InChI Key: InChIKey=LAIZZARYEKDANP-UHFFFAOYSA-N
Data: 1 IC50
Activity Spreadsheet -- Enzyme Inhibition Constant Data from BindingDB
Found 1 hit for monomerid = 50195009
Trg + Lig
Ki
nM
ΔG°
kcal/mole
IC50
nM
Kd
nM
EC50/IC50
nM
koff
s-1
kon
M-1s-1
pHTemp
°C
Mitogen-activated protein kinase kinase kinase 8
(Homo sapiens (Human))
BDBM50195009
(4-(3-chloro-4-fluorophenylamino)-6-((4-methyl-1-(2...)
Show SMILES Cc1ncn(CCN2CCOCC2)c1CNc1ccc2ncc(C#N)c(Nc3ccc(F)c(Cl)c3)c2c1
Show InChI InChI=1S/C27H27ClFN7O/c1-18-26(36(17-33-18)7-6-35-8-10-37-11-9-35)16-31-20-3-5-25-22(12-20)27(19(14-30)15-32-25)34-21-2-4-24(29)23(28)13-21/h2-5,12-13,15,17,31H,6-11,16H2,1H3,(H,32,34)
NCI pathway
Reactome pathway
n/an/a 260n/an/an/an/an/an/a
Wyeth Research
Curated by ChEMBL
Assay Description
Inhibition of Tpl2 kinase by ELISA
Bioorg Med Chem Lett 16: 6067-72 (2006)
Article DOI: 10.1016/j.bmcl.2006.08.102
BindingDB Entry DOI: 10.7270/Q2W958TR