BDBM50195078 2-((5-(2-(5-methyl-2-phenyloxazol-4-yl)ethoxy)pyrazin-2-yl)methyl)-tetrahydrofuran-2-carboxylic acid::CHEMBL221490
SMILES: Cc1oc(nc1CCOc1cnc(CC2(CCCO2)C(O)=O)cn1)-c1ccccc1
InChI Key: InChIKey=MAONNETYMMEJLZ-UHFFFAOYSA-N
Data: 2 KI  2 EC50
Activity Spreadsheet -- Enzyme Inhibition Constant Data from BindingDB
Found 4 hits for monomerid = 50195078
Trg + Lig
Ki
nM
ΔG°
kcal/mole
IC50
nM
Kd
nM
EC50/IC50
nM
koff
s-1
kon
M-1s-1
pHTemp
°C
Peroxisome proliferator-activated receptor
(Homo sapiens (Human))
BDBM50195078
(2-((5-(2-(5-methyl-2-phenyloxazol-4-yl)ethoxy)pyra...)
Show SMILES Cc1oc(nc1CCOc1cnc(CC2(CCCO2)C(O)=O)cn1)-c1ccccc1
Show InChI InChI=1S/C22H23N3O5/c1-15-18(25-20(30-15)16-6-3-2-4-7-16)8-11-28-19-14-23-17(13-24-19)12-22(21(26)27)9-5-10-29-22/h2-4,6-7,13-14H,5,8-12H2,1H3,(H,26,27)
NCI pathway
Reactome pathway
160n/an/an/an/an/an/an/an/a
Pfizer Global R&D
Curated by ChEMBL
Assay Description
Displacement of radiolabeled darglitazone from human PPAR gamma by SPA assay
Bioorg Med Chem Lett 16: 6116-9 (2006)
Article DOI: 10.1016/j.bmcl.2006.08.105
BindingDB Entry DOI: 10.7270/Q2H131P4
Peroxisome proliferator-activated receptor alpha (PPAR alpha)
(Homo sapiens (Human))
BDBM50195078
(2-((5-(2-(5-methyl-2-phenyloxazol-4-yl)ethoxy)pyra...)
Show SMILES Cc1oc(nc1CCOc1cnc(CC2(CCCO2)C(O)=O)cn1)-c1ccccc1
Show InChI InChI=1S/C22H23N3O5/c1-15-18(25-20(30-15)16-6-3-2-4-7-16)8-11-28-19-14-23-17(13-24-19)12-22(21(26)27)9-5-10-29-22/h2-4,6-7,13-14H,5,8-12H2,1H3,(H,26,27)
3.49E+3n/an/an/an/an/an/an/an/a
Pfizer Global R&D
Curated by ChEMBL
Assay Description
Displacement of radiolabeled GW2331 from human PPAR alpha by SPA assay
Bioorg Med Chem Lett 16: 6116-9 (2006)
Article DOI: 10.1016/j.bmcl.2006.08.105
BindingDB Entry DOI: 10.7270/Q2H131P4
Peroxisome proliferator-activated receptor alpha (PPAR alpha)
(Homo sapiens (Human))
BDBM50195078
(2-((5-(2-(5-methyl-2-phenyloxazol-4-yl)ethoxy)pyra...)
Show SMILES Cc1oc(nc1CCOc1cnc(CC2(CCCO2)C(O)=O)cn1)-c1ccccc1
Show InChI InChI=1S/C22H23N3O5/c1-15-18(25-20(30-15)16-6-3-2-4-7-16)8-11-28-19-14-23-17(13-24-19)12-22(21(26)27)9-5-10-29-22/h2-4,6-7,13-14H,5,8-12H2,1H3,(H,26,27)
n/an/an/an/a 1.89E+3n/an/an/an/a
Pfizer Global R&D
Curated by ChEMBL
Assay Description
Agonist activity at human PPAR alpha in HepG2 cells by PPAR-GAL4 transactivation assay
Bioorg Med Chem Lett 16: 6116-9 (2006)
Article DOI: 10.1016/j.bmcl.2006.08.105
BindingDB Entry DOI: 10.7270/Q2H131P4
Peroxisome proliferator-activated receptor
(Homo sapiens (Human))
BDBM50195078
(2-((5-(2-(5-methyl-2-phenyloxazol-4-yl)ethoxy)pyra...)
Show SMILES Cc1oc(nc1CCOc1cnc(CC2(CCCO2)C(O)=O)cn1)-c1ccccc1
Show InChI InChI=1S/C22H23N3O5/c1-15-18(25-20(30-15)16-6-3-2-4-7-16)8-11-28-19-14-23-17(13-24-19)12-22(21(26)27)9-5-10-29-22/h2-4,6-7,13-14H,5,8-12H2,1H3,(H,26,27)
NCI pathway
Reactome pathway
n/an/an/an/a 156n/an/an/an/a
Pfizer Global R&D
Curated by ChEMBL
Assay Description
Agonist activity at human PPAR gamma in HepG2 cells by PPAR-GAL4 transactivation assay
Bioorg Med Chem Lett 16: 6116-9 (2006)
Article DOI: 10.1016/j.bmcl.2006.08.105
BindingDB Entry DOI: 10.7270/Q2H131P4