BDBM50195213 3-(5-(piperidin-1-ylmethyl)-1H-indol-2-yl)-6-(1H-pyrazol-4-yl)quinolin-2(1H)-one::3-[5-(PIPERIDIN-1-YLMETHYL)-1H-INDOL-2-YL]-6-(1H-PYRAZOL-4-YL)QUINOLIN-2(1H)-ONE::CHEMBL374662
SMILES: O=c1[nH]c2ccc(cc2cc1-c1cc2cc(CN3CCCCC3)ccc2[nH]1)-c1cn[nH]c1
InChI Key: InChIKey=JRWKQEATLFJZFB-UHFFFAOYSA-N
Data: 1 IC50  1 EC50
PDB links: 1 PDB ID matches this monomer.
Activity Spreadsheet -- Enzyme Inhibition Constant Data from BindingDB
Found 2 hits for monomerid = 50195213
Trg + Lig
Ki
nM
ΔG°
kcal/mole
IC50
nM
Kd
nM
EC50/IC50
nM
koff
s-1
kon
M-1s-1
pHTemp
°C
Serine/threonine-protein kinase Chk1
(Homo sapiens (Human))
BDBM50195213
(3-(5-(piperidin-1-ylmethyl)-1H-indol-2-yl)-6-(1H-p...)
Show SMILES O=c1[nH]c2ccc(cc2cc1-c1cc2cc(CN3CCCCC3)ccc2[nH]1)-c1cn[nH]c1
Show InChI InChI=1S/C26H25N5O/c32-26-22(12-20-11-18(5-7-24(20)30-26)21-14-27-28-15-21)25-13-19-10-17(4-6-23(19)29-25)16-31-8-2-1-3-9-31/h4-7,10-15,29H,1-3,8-9,16H2,(H,27,28)(H,30,32)
Reactome pathway
n/an/an/an/a 97n/an/an/an/a
Merck Research Laboratories
Curated by ChEMBL
Assay Description
Release of camptothecin-induced cell cycle arrest in NCI-H1299 cells mediated by CHEK1 inhibition
Bioorg Med Chem Lett 16: 5907-12 (2006)
Article DOI: 10.1016/j.bmcl.2006.08.053
BindingDB Entry DOI: 10.7270/Q27H1J73
3D
3D Structure (crystal)
Serine/threonine-protein kinase Chk1
(Homo sapiens (Human))
BDBM50195213
(3-(5-(piperidin-1-ylmethyl)-1H-indol-2-yl)-6-(1H-p...)
Show SMILES O=c1[nH]c2ccc(cc2cc1-c1cc2cc(CN3CCCCC3)ccc2[nH]1)-c1cn[nH]c1
Show InChI InChI=1S/C26H25N5O/c32-26-22(12-20-11-18(5-7-24(20)30-26)21-14-27-28-15-21)25-13-19-10-17(4-6-23(19)29-25)16-31-8-2-1-3-9-31/h4-7,10-15,29H,1-3,8-9,16H2,(H,27,28)(H,30,32)
Reactome pathway
n/an/a 0.650n/an/an/an/an/an/a
Merck Research Laboratories
Curated by ChEMBL
Assay Description
Inhibition of human CHEK1
Bioorg Med Chem Lett 16: 5907-12 (2006)
Article DOI: 10.1016/j.bmcl.2006.08.053
BindingDB Entry DOI: 10.7270/Q27H1J73
3D
3D Structure (crystal)