BDBM50195551 1,2-bis(4-chlorophenyl)-5-hydroxy-4-(4-trifluoromethoxybenzoyl)-1,2-dihydropyrazol-3-one::CHEMBL217409
SMILES: Oc1c(C(=O)c2ccc(OC(F)(F)F)cc2)c(=O)n(-c2ccc(Cl)cc2)n1-c1ccc(Cl)cc1
InChI Key: InChIKey=XYXFHVHOBJXCNL-UHFFFAOYSA-N
Data: 1 IC50
Activity Spreadsheet -- Enzyme Inhibition Constant Data from BindingDB
Found 1 hit for monomerid = 50195551
Trg + Lig
Ki
nM
ΔG°
kcal/mole
IC50
nM
Kd
nM
EC50/IC50
nM
koff
s-1
kon
M-1s-1
pHTemp
°C
MurB (E. coli)
(Escherichia coli K-12 (Enterobacteria))
BDBM50195551
(1,2-bis(4-chlorophenyl)-5-hydroxy-4-(4-trifluorome...)
Show SMILES Oc1c(C(=O)c2ccc(OC(F)(F)F)cc2)c(=O)n(-c2ccc(Cl)cc2)n1-c1ccc(Cl)cc1
Show InChI InChI=1S/C23H13Cl2F3N2O4/c24-14-3-7-16(8-4-14)29-21(32)19(22(33)30(29)17-9-5-15(25)6-10-17)20(31)13-1-11-18(12-2-13)34-23(26,27)28/h1-12,32H
n/an/a 5.40E+3n/an/an/an/an/an/a
Wyeth
Curated by ChEMBL
Assay Description
Inhibition of MurB activity
J Med Chem 49: 6027-36 (2006)
Article DOI: 10.1021/jm060499t
BindingDB Entry DOI: 10.7270/Q22V2FRV