BDBM50195602 CHEMBL216834::N-hydroxy-8-(3,4-dihydro-4-oxo-6-phenyl-2-pyrimidinylthio)octanamide
SMILES: ONC(=O)CCCCCCCSc1nc(cc(=O)[nH]1)-c1ccccc1
InChI Key: InChIKey=UIRNMMXBIYHTCQ-UHFFFAOYSA-N
Data: 2 IC50
Activity Spreadsheet -- Enzyme Inhibition Constant Data from BindingDB
Found 2 hits for monomerid = 50195602
Trg + Lig
Ki
nM
ΔG°
kcal/mole
IC50
nM
Kd
nM
EC50/IC50
nM
koff
s-1
kon
M-1s-1
pHTemp
°C
Histone deacetylase HD2
(Zea mays)
BDBM50195602
(CHEMBL216834 | N-hydroxy-8-(3,4-dihydro-4-oxo-6-ph...)
Show SMILES ONC(=O)CCCCCCCSc1nc(cc(=O)[nH]1)-c1ccccc1
Show InChI InChI=1S/C18H23N3O3S/c22-16(21-24)11-7-2-1-3-8-12-25-18-19-15(13-17(23)20-18)14-9-5-4-6-10-14/h4-6,9-10,13,24H,1-3,7-8,11-12H2,(H,21,22)(H,19,20,23)
n/an/a 42n/an/an/an/an/an/a
Università degli Studi di Roma La Sapienza
Curated by ChEMBL
Assay Description
Inhibition of maize HD2
J Med Chem 49: 6046-56 (2006)
Article DOI: 10.1021/jm0605536
BindingDB Entry DOI: 10.7270/Q2Z31Z9B
Histone deacetylase HD1B
(Zea mays)
BDBM50195602
(CHEMBL216834 | N-hydroxy-8-(3,4-dihydro-4-oxo-6-ph...)
Show SMILES ONC(=O)CCCCCCCSc1nc(cc(=O)[nH]1)-c1ccccc1
Show InChI InChI=1S/C18H23N3O3S/c22-16(21-24)11-7-2-1-3-8-12-25-18-19-15(13-17(23)20-18)14-9-5-4-6-10-14/h4-6,9-10,13,24H,1-3,7-8,11-12H2,(H,21,22)(H,19,20,23)
n/an/a 89n/an/an/an/an/an/a
Università degli Studi di Roma La Sapienza
Curated by ChEMBL
Assay Description
Inhibition of maize HD1B
J Med Chem 49: 6046-56 (2006)
Article DOI: 10.1021/jm0605536
BindingDB Entry DOI: 10.7270/Q2Z31Z9B