BDBM50195626 3beta-ol-23,24-bisnor-5-en-22-(propanoic acid) amide::CHEMBL217006
SMILES: C[C@@H]([C@H]1CC[C@H]2C3CC=C4C[C@@H](O)CC[C@]4(C)[C@H]3CC[C@]12C)C(=O)NCCC(O)=O
InChI Key: InChIKey=YAKIVEOUPZUBMW-RAOKHAEJSA-N
Data: 1 IC50
Activity Spreadsheet -- Enzyme Inhibition Constant Data from BindingDB
Found 1 hit for monomerid = 50195626
Trg + Lig
Ki
nM
ΔG°
kcal/mole
IC50
nM
Kd
nM
EC50/IC50
nM
koff
s-1
kon
M-1s-1
pHTemp
°C
24-sterol C-methyltransferase
(Arabidopsis thaliana)
BDBM50195626
(3beta-ol-23,24-bisnor-5-en-22-(propanoic acid) ami...)
Show SMILES C[C@@H]([C@H]1CC[C@H]2C3CC=C4C[C@@H](O)CC[C@]4(C)[C@H]3CC[C@]12C)C(=O)NCCC(O)=O |t:8|
Show InChI InChI=1S/C25H39NO4/c1-15(23(30)26-13-10-22(28)29)19-6-7-20-18-5-4-16-14-17(27)8-11-24(16,2)21(18)9-12-25(19,20)3/h4,15,17-21,27H,5-14H2,1-3H3,(H,26,30)(H,28,29)/t15-,17-,18?,19+,20-,21-,24-,25+/m0/s1
n/an/a>1.00E+5n/an/an/an/an/an/a
Cardiff University
Curated by ChEMBL
Assay Description
Inhibition of Leishmania major recombinant 24-SMT
J Med Chem 49: 6094-103 (2006)
Article DOI: 10.1021/jm060290f
BindingDB Entry DOI: 10.7270/Q2TB16JJ