BDBM50195631 3beta-acetoxy-23,24-bisnor-chol-5-en-22-(methyl hexanoate) amine::CHEMBL387268
SMILES: COC(=O)CCCCCNC[C@@H](C)[C@H]1CC[C@H]2C3CC=C4C[C@H](CC[C@]4(C)[C@H]3CC[C@]12C)OC(C)=O
InChI Key: InChIKey=SZGAPLIRORJXMB-KLKQPUDMSA-N
Data: 2 IC50
Activity Spreadsheet -- Enzyme Inhibition Constant Data from BindingDB
Found 2 hits for monomerid = 50195631
Trg + Lig
Ki
nM
ΔG°
kcal/mole
IC50
nM
Kd
nM
EC50/IC50
nM
koff
s-1
kon
M-1s-1
pHTemp
°C
24-sterol C-methyltransferase
(Arabidopsis thaliana)
BDBM50195631
(3beta-acetoxy-23,24-bisnor-chol-5-en-22-(methyl he...)
Show SMILES COC(=O)CCCCCNC[C@@H](C)[C@H]1CC[C@H]2C3CC=C4C[C@H](CC[C@]4(C)[C@H]3CC[C@]12C)OC(C)=O |t:19|
Show InChI InChI=1S/C31H51NO4/c1-21(20-32-18-8-6-7-9-29(34)35-5)26-12-13-27-25-11-10-23-19-24(36-22(2)33)14-16-30(23,3)28(25)15-17-31(26,27)4/h10,21,24-28,32H,6-9,11-20H2,1-5H3/t21-,24+,25?,26-,27+,28+,30+,31-/m1/s1
n/an/a>1.00E+5n/an/an/an/an/an/a
Cardiff University
Curated by ChEMBL
Assay Description
Inhibition of Trypanosoma brucei brucei recombinant 24-SMT
J Med Chem 49: 6094-103 (2006)
Article DOI: 10.1021/jm060290f
BindingDB Entry DOI: 10.7270/Q2TB16JJ
24-sterol C-methyltransferase
(Arabidopsis thaliana)
BDBM50195631
(3beta-acetoxy-23,24-bisnor-chol-5-en-22-(methyl he...)
Show SMILES COC(=O)CCCCCNC[C@@H](C)[C@H]1CC[C@H]2C3CC=C4C[C@H](CC[C@]4(C)[C@H]3CC[C@]12C)OC(C)=O |t:19|
Show InChI InChI=1S/C31H51NO4/c1-21(20-32-18-8-6-7-9-29(34)35-5)26-12-13-27-25-11-10-23-19-24(36-22(2)33)14-16-30(23,3)28(25)15-17-31(26,27)4/h10,21,24-28,32H,6-9,11-20H2,1-5H3/t21-,24+,25?,26-,27+,28+,30+,31-/m1/s1
n/an/a>1.00E+5n/an/an/an/an/an/a
Cardiff University
Curated by ChEMBL
Assay Description
Inhibition of Leishmania major recombinant 24-SMT
J Med Chem 49: 6094-103 (2006)
Article DOI: 10.1021/jm060290f
BindingDB Entry DOI: 10.7270/Q2TB16JJ