BDBM50195634 3beta-acetoxy-23,24-bisnor-5-en-22-(4-(2-Boc-amino)butanoic acid) amide::CHEMBL385193
SMILES: C[C@@H]([C@H]1CC[C@H]2C3CC=C4C[C@H](CC[C@]4(C)[C@H]3CC[C@]12C)OC(C)=O)C(=O)NCC[C@H](NC(=O)OC(C)(C)C)C(O)=O
InChI Key: InChIKey=WVYWNLXUHFXESO-CEVZOLLJSA-N
Data: 1 IC50
Activity Spreadsheet -- Enzyme Inhibition Constant Data from BindingDB
Found 1 hit for monomerid = 50195634
Trg + Lig
Ki
nM
ΔG°
kcal/mole
IC50
nM
Kd
nM
EC50/IC50
nM
koff
s-1
kon
M-1s-1
pHTemp
°C
24-sterol C-methyltransferase
(Arabidopsis thaliana)
BDBM50195634
(3beta-acetoxy-23,24-bisnor-5-en-22-(4-(2-Boc-amino...)
Show SMILES C[C@@H]([C@H]1CC[C@H]2C3CC=C4C[C@H](CC[C@]4(C)[C@H]3CC[C@]12C)OC(C)=O)C(=O)NCC[C@H](NC(=O)OC(C)(C)C)C(O)=O |t:8|
Show InChI InChI=1S/C33H52N2O7/c1-19(28(37)34-17-14-27(29(38)39)35-30(40)42-31(3,4)5)24-10-11-25-23-9-8-21-18-22(41-20(2)36)12-15-32(21,6)26(23)13-16-33(24,25)7/h8,19,22-27H,9-18H2,1-7H3,(H,34,37)(H,35,40)(H,38,39)/t19-,22-,23?,24+,25-,26-,27-,32-,33+/m0/s1
n/an/a>1.00E+5n/an/an/an/an/an/a
Cardiff University
Curated by ChEMBL
Assay Description
Inhibition of Leishmania major recombinant 24-SMT
J Med Chem 49: 6094-103 (2006)
Article DOI: 10.1021/jm060290f
BindingDB Entry DOI: 10.7270/Q2TB16JJ