BDBM50195636 3beta-ol-23,24-bisnor-5-en-22-(butanoic acid) amine::CHEMBL217534
SMILES: C[C@H](CNCCCC(O)=O)[C@H]1CC[C@H]2C3CC=C4C[C@@H](O)CC[C@]4(C)[C@H]3CC[C@]12C
InChI Key: InChIKey=JVCKCYKRSUUGRH-WKYKGEOCSA-N
Data: 1 IC50
Activity Spreadsheet -- Enzyme Inhibition Constant Data from BindingDB
Found 1 hit for monomerid = 50195636
Trg + Lig
Ki
nM
ΔG°
kcal/mole
IC50
nM
Kd
nM
EC50/IC50
nM
koff
s-1
kon
M-1s-1
pHTemp
°C
24-sterol C-methyltransferase
(Arabidopsis thaliana)
BDBM50195636
(3beta-ol-23,24-bisnor-5-en-22-(butanoic acid) amin...)
Show SMILES C[C@H](CNCCCC(O)=O)[C@H]1CC[C@H]2C3CC=C4C[C@@H](O)CC[C@]4(C)[C@H]3CC[C@]12C |t:16|
Show InChI InChI=1S/C26H43NO3/c1-17(16-27-14-4-5-24(29)30)21-8-9-22-20-7-6-18-15-19(28)10-12-25(18,2)23(20)11-13-26(21,22)3/h6,17,19-23,27-28H,4-5,7-16H2,1-3H3,(H,29,30)/t17-,19+,20?,21-,22+,23+,25+,26-/m1/s1
n/an/a 4.00E+3n/an/an/an/an/an/a
Cardiff University
Curated by ChEMBL
Assay Description
Inhibition of Leishmania major recombinant 24-SMT
J Med Chem 49: 6094-103 (2006)
Article DOI: 10.1021/jm060290f
BindingDB Entry DOI: 10.7270/Q2TB16JJ