BDBM50195645 3beta-ol-23,24-bisnor-5-en-22-(octanoic acid) amide::CHEMBL217576
SMILES: C[C@@H]([C@H]1CC[C@H]2C3CC=C4C[C@@H](O)CC[C@]4(C)[C@H]3CC[C@]12C)C(=O)NCCCCCCCC(O)=O
InChI Key: InChIKey=UQGWAXLBYYPNLN-KCSPDKRNSA-N
Data: 1 IC50
Activity Spreadsheet -- Enzyme Inhibition Constant Data from BindingDB
Found 1 hit for monomerid = 50195645
Trg + Lig
Ki
nM
ΔG°
kcal/mole
IC50
nM
Kd
nM
EC50/IC50
nM
koff
s-1
kon
M-1s-1
pHTemp
°C
24-sterol C-methyltransferase
(Arabidopsis thaliana)
BDBM50195645
(3beta-ol-23,24-bisnor-5-en-22-(octanoic acid) amid...)
Show SMILES C[C@@H]([C@H]1CC[C@H]2C3CC=C4C[C@@H](O)CC[C@]4(C)[C@H]3CC[C@]12C)C(=O)NCCCCCCCC(O)=O |t:8|
Show InChI InChI=1S/C30H49NO4/c1-20(28(35)31-18-8-6-4-5-7-9-27(33)34)24-12-13-25-23-11-10-21-19-22(32)14-16-29(21,2)26(23)15-17-30(24,25)3/h10,20,22-26,32H,4-9,11-19H2,1-3H3,(H,31,35)(H,33,34)/t20-,22-,23?,24+,25-,26-,29-,30+/m0/s1
n/an/a>1.00E+5n/an/an/an/an/an/a
Cardiff University
Curated by ChEMBL
Assay Description
Inhibition of Leishmania major recombinant 24-SMT
J Med Chem 49: 6094-103 (2006)
Article DOI: 10.1021/jm060290f
BindingDB Entry DOI: 10.7270/Q2TB16JJ