BDBM50195649 3beta-ol-23,24-bisnor-5-en-22-(hexanoic acid) amine::CHEMBL262278
SMILES: C[C@H](CNCCCCCC(O)=O)[C@H]1CC[C@H]2C3CC=C4C[C@@H](O)CC[C@]4(C)[C@H]3CC[C@]12C
InChI Key: InChIKey=WMZFNPVKHXBOLV-AAMLSXOSSA-N
Data: 1 IC50
Activity Spreadsheet -- Enzyme Inhibition Constant Data from BindingDB
Found 1 hit for monomerid = 50195649
Trg + Lig
Ki
nM
ΔG°
kcal/mole
IC50
nM
Kd
nM
EC50/IC50
nM
koff
s-1
kon
M-1s-1
pHTemp
°C
24-sterol C-methyltransferase
(Arabidopsis thaliana)
BDBM50195649
(3beta-ol-23,24-bisnor-5-en-22-(hexanoic acid) amin...)
Show SMILES C[C@H](CNCCCCCC(O)=O)[C@H]1CC[C@H]2C3CC=C4C[C@@H](O)CC[C@]4(C)[C@H]3CC[C@]12C |t:18|
Show InChI InChI=1S/C28H47NO3/c1-19(18-29-16-6-4-5-7-26(31)32)23-10-11-24-22-9-8-20-17-21(30)12-14-27(20,2)25(22)13-15-28(23,24)3/h8,19,21-25,29-30H,4-7,9-18H2,1-3H3,(H,31,32)/t19-,21+,22?,23-,24+,25+,27+,28-/m1/s1
n/an/a>1.00E+5n/an/an/an/an/an/a
Cardiff University
Curated by ChEMBL
Assay Description
Inhibition of Leishmania major recombinant 24-SMT
J Med Chem 49: 6094-103 (2006)
Article DOI: 10.1021/jm060290f
BindingDB Entry DOI: 10.7270/Q2TB16JJ