BDBM50195826 ({[({[(2R,3S,4R,5R)-3,4-dihydroxy-5-(1-oxo-1,2-dihydroisoquinolin-2-yl)oxolan-2-yl]methoxy}(hydroxy)phosphoryl)oxy](hydroxy)phosphoryl}oxy)phosphonic acid::CHEMBL393100
SMILES: O[C@H]1[C@@H](O)[C@@H](O[C@@H]1COP(O)(=O)OP(O)(=O)OP(O)(O)=O)n1ccc2ccccc2c1=O
InChI Key: InChIKey=VNYFQXUDSXOXNV-HKUMRIAESA-N
Data: 4 EC50
Activity Spreadsheet -- Enzyme Inhibition Constant Data from BindingDB
Found 4 hits for monomerid = 50195826
Trg + Lig
Ki
nM
ΔG°
kcal/mole
IC50
nM
Kd
nM
EC50/IC50
nM
koff
s-1
kon
M-1s-1
pHTemp
°C
Purinergic receptor P2Y2
(Homo sapiens (Human))
BDBM50195826
(({[({[(2R,3S,4R,5R)-3,4-dihydroxy-5-(1-oxo-1,2-dih...)
Show SMILES O[C@H]1[C@@H](O)[C@@H](O[C@@H]1COP(O)(=O)OP(O)(=O)OP(O)(O)=O)n1ccc2ccccc2c1=O |w:9.10,13.14|
Show InChI InChI=1S/C14H18NO14P3/c16-11-10(7-26-31(22,23)29-32(24,25)28-30(19,20)21)27-14(12(11)17)15-6-5-8-3-1-2-4-9(8)13(15)18/h1-6,10-12,14,16-17H,7H2,(H,22,23)(H,24,25)(H2,19,20,21)/t10-,11-,12-,14-/m1/s1
Reactome pathway
n/an/an/an/a 31n/an/an/an/a
UCB-Group
Curated by ChEMBL
Assay Description
Agonist activity at human P2Y2 receptor expressed in human 1321N1 by FLIPR assay
Bioorg Med Chem Lett 17: 562-5 (2007)
Article DOI: 10.1016/j.bmcl.2006.09.017
BindingDB Entry DOI: 10.7270/Q2CC11JS
Pyrimidinergic receptor P2Y6
(Homo sapiens (Human))
BDBM50195826
(({[({[(2R,3S,4R,5R)-3,4-dihydroxy-5-(1-oxo-1,2-dih...)
Show SMILES O[C@H]1[C@@H](O)[C@@H](O[C@@H]1COP(O)(=O)OP(O)(=O)OP(O)(O)=O)n1ccc2ccccc2c1=O |w:9.10,13.14|
Show InChI InChI=1S/C14H18NO14P3/c16-11-10(7-26-31(22,23)29-32(24,25)28-30(19,20)21)27-14(12(11)17)15-6-5-8-3-1-2-4-9(8)13(15)18/h1-6,10-12,14,16-17H,7H2,(H,22,23)(H,24,25)(H2,19,20,21)/t10-,11-,12-,14-/m1/s1
Reactome pathway
n/an/an/an/a>2.00E+4n/an/an/an/a
UCB-Group
Curated by ChEMBL
Assay Description
Agonist activity at human cloned P2Y6 receptor expressed in human 1321N1 by FLIPR assay
Bioorg Med Chem Lett 17: 562-5 (2007)
Article DOI: 10.1016/j.bmcl.2006.09.017
BindingDB Entry DOI: 10.7270/Q2CC11JS
Purinergic receptor P2Y1
(Homo sapiens (Human))
BDBM50195826
(({[({[(2R,3S,4R,5R)-3,4-dihydroxy-5-(1-oxo-1,2-dih...)
Show SMILES O[C@H]1[C@@H](O)[C@@H](O[C@@H]1COP(O)(=O)OP(O)(=O)OP(O)(O)=O)n1ccc2ccccc2c1=O |w:9.10,13.14|
Show InChI InChI=1S/C14H18NO14P3/c16-11-10(7-26-31(22,23)29-32(24,25)28-30(19,20)21)27-14(12(11)17)15-6-5-8-3-1-2-4-9(8)13(15)18/h1-6,10-12,14,16-17H,7H2,(H,22,23)(H,24,25)(H2,19,20,21)/t10-,11-,12-,14-/m1/s1
n/an/an/an/a>2.00E+4n/an/an/an/a
UCB-Group
Curated by ChEMBL
Assay Description
Agonist activity at human cloned P2Y1 receptor expressed in human 1321N1 by FLIPR assay
Bioorg Med Chem Lett 17: 562-5 (2007)
Article DOI: 10.1016/j.bmcl.2006.09.017
BindingDB Entry DOI: 10.7270/Q2CC11JS
Pyrimidinergic receptor P2Y4
(Homo sapiens (Human))
BDBM50195826
(({[({[(2R,3S,4R,5R)-3,4-dihydroxy-5-(1-oxo-1,2-dih...)
Show SMILES O[C@H]1[C@@H](O)[C@@H](O[C@@H]1COP(O)(=O)OP(O)(=O)OP(O)(O)=O)n1ccc2ccccc2c1=O |w:9.10,13.14|
Show InChI InChI=1S/C14H18NO14P3/c16-11-10(7-26-31(22,23)29-32(24,25)28-30(19,20)21)27-14(12(11)17)15-6-5-8-3-1-2-4-9(8)13(15)18/h1-6,10-12,14,16-17H,7H2,(H,22,23)(H,24,25)(H2,19,20,21)/t10-,11-,12-,14-/m1/s1
Reactome pathway
n/an/an/an/a 7.04E+3n/an/an/an/a
UCB-Group
Curated by ChEMBL
Assay Description
Agonist activity at human cloned P2Y4 receptor expressed in human 1321N1 by FLIPR assay
Bioorg Med Chem Lett 17: 562-5 (2007)
Article DOI: 10.1016/j.bmcl.2006.09.017
BindingDB Entry DOI: 10.7270/Q2CC11JS