BDBM50195828 ({[({[(2R,3S,4R,5R)-5-(7-chloro-1-oxo-1,2-dihydroisoquinolin-2-yl)-3,4-dihydroxyoxolan-2-yl]methoxy}(hydroxy)phosphoryl)oxy](hydroxy)phosphoryl}oxy)phosphonic acid::CHEMBL240201
SMILES: O[C@H]1[C@@H](O)[C@@H](O[C@@H]1COP(O)(=O)OP(O)(=O)OP(O)(O)=O)n1ccc2ccc(Cl)cc2c1=O
InChI Key: InChIKey=OIBMBKVCJFCFMA-HKUMRIAESA-N
Data: 4 EC50
Activity Spreadsheet -- Enzyme Inhibition Constant Data from BindingDB
Found 4 hits for monomerid = 50195828
Trg + Lig
Ki
nM
ΔG°
kcal/mole
IC50
nM
Kd
nM
EC50/IC50
nM
koff
s-1
kon
M-1s-1
pHTemp
°C
Pyrimidinergic receptor P2Y4
(Homo sapiens (Human))
BDBM50195828
(({[({[(2R,3S,4R,5R)-5-(7-chloro-1-oxo-1,2-dihydroi...)
Show SMILES O[C@H]1[C@@H](O)[C@@H](O[C@@H]1COP(O)(=O)OP(O)(=O)OP(O)(O)=O)n1ccc2ccc(Cl)cc2c1=O |w:9.10,13.14|
Show InChI InChI=1S/C14H17ClNO14P3/c15-8-2-1-7-3-4-16(13(19)9(7)5-8)14-12(18)11(17)10(28-14)6-27-32(23,24)30-33(25,26)29-31(20,21)22/h1-5,10-12,14,17-18H,6H2,(H,23,24)(H,25,26)(H2,20,21,22)/t10-,11-,12-,14-/m1/s1
Reactome pathway
n/an/an/an/a 2.00E+4n/an/an/an/a
UCB-Group
Curated by ChEMBL
Assay Description
Agonist activity at human cloned P2Y4 receptor expressed in human 1321N1 by FLIPR assay
Bioorg Med Chem Lett 17: 562-5 (2007)
Article DOI: 10.1016/j.bmcl.2006.09.017
BindingDB Entry DOI: 10.7270/Q2CC11JS
Purinergic receptor P2Y2
(Homo sapiens (Human))
BDBM50195828
(({[({[(2R,3S,4R,5R)-5-(7-chloro-1-oxo-1,2-dihydroi...)
Show SMILES O[C@H]1[C@@H](O)[C@@H](O[C@@H]1COP(O)(=O)OP(O)(=O)OP(O)(O)=O)n1ccc2ccc(Cl)cc2c1=O |w:9.10,13.14|
Show InChI InChI=1S/C14H17ClNO14P3/c15-8-2-1-7-3-4-16(13(19)9(7)5-8)14-12(18)11(17)10(28-14)6-27-32(23,24)30-33(25,26)29-31(20,21)22/h1-5,10-12,14,17-18H,6H2,(H,23,24)(H,25,26)(H2,20,21,22)/t10-,11-,12-,14-/m1/s1
Reactome pathway
n/an/an/an/a 10n/an/an/an/a
UCB-Group
Curated by ChEMBL
Assay Description
Agonist activity at human P2Y2 receptor expressed in human 1321N1 by FLIPR assay
Bioorg Med Chem Lett 17: 562-5 (2007)
Article DOI: 10.1016/j.bmcl.2006.09.017
BindingDB Entry DOI: 10.7270/Q2CC11JS
Purinergic receptor P2Y1
(Homo sapiens (Human))
BDBM50195828
(({[({[(2R,3S,4R,5R)-5-(7-chloro-1-oxo-1,2-dihydroi...)
Show SMILES O[C@H]1[C@@H](O)[C@@H](O[C@@H]1COP(O)(=O)OP(O)(=O)OP(O)(O)=O)n1ccc2ccc(Cl)cc2c1=O |w:9.10,13.14|
Show InChI InChI=1S/C14H17ClNO14P3/c15-8-2-1-7-3-4-16(13(19)9(7)5-8)14-12(18)11(17)10(28-14)6-27-32(23,24)30-33(25,26)29-31(20,21)22/h1-5,10-12,14,17-18H,6H2,(H,23,24)(H,25,26)(H2,20,21,22)/t10-,11-,12-,14-/m1/s1
n/an/an/an/a>2.00E+4n/an/an/an/a
UCB-Group
Curated by ChEMBL
Assay Description
Agonist activity at human cloned P2Y1 receptor expressed in human 1321N1 by FLIPR assay
Bioorg Med Chem Lett 17: 562-5 (2007)
Article DOI: 10.1016/j.bmcl.2006.09.017
BindingDB Entry DOI: 10.7270/Q2CC11JS
Pyrimidinergic receptor P2Y6
(Homo sapiens (Human))
BDBM50195828
(({[({[(2R,3S,4R,5R)-5-(7-chloro-1-oxo-1,2-dihydroi...)
Show SMILES O[C@H]1[C@@H](O)[C@@H](O[C@@H]1COP(O)(=O)OP(O)(=O)OP(O)(O)=O)n1ccc2ccc(Cl)cc2c1=O |w:9.10,13.14|
Show InChI InChI=1S/C14H17ClNO14P3/c15-8-2-1-7-3-4-16(13(19)9(7)5-8)14-12(18)11(17)10(28-14)6-27-32(23,24)30-33(25,26)29-31(20,21)22/h1-5,10-12,14,17-18H,6H2,(H,23,24)(H,25,26)(H2,20,21,22)/t10-,11-,12-,14-/m1/s1
Reactome pathway
n/an/an/an/a>2.00E+4n/an/an/an/a
UCB-Group
Curated by ChEMBL
Assay Description
Agonist activity at human cloned P2Y6 receptor expressed in human 1321N1 by FLIPR assay
Bioorg Med Chem Lett 17: 562-5 (2007)
Article DOI: 10.1016/j.bmcl.2006.09.017
BindingDB Entry DOI: 10.7270/Q2CC11JS