BDBM50195847 ({[({[(2R,3S,4R,5R)-5-(7-fluoro-6-methoxy-1-oxo-1,2-dihydroisoquinolin-2-yl)-3,4-dihydroxyoxolan-2-yl]methoxy}(hydroxy)phosphoryl)oxy](hydroxy)phosphoryl}oxy)phosphonic acid::CHEMBL238542
SMILES: COc1cc2ccn([C@@H]3O[C@H](COP(O)(=O)OP(O)(=O)OP(O)(O)=O)[C@@H](O)[C@H]3O)c(=O)c2cc1F
InChI Key: InChIKey=ZTWLGWQROYMNDZ-RGCMKSIDSA-N
Data: 1 EC50
Activity Spreadsheet -- Enzyme Inhibition Constant Data from BindingDB
Found 1 hit for monomerid = 50195847
Trg + Lig
Ki
nM
ΔG°
kcal/mole
IC50
nM
Kd
nM
EC50/IC50
nM
koff
s-1
kon
M-1s-1
pHTemp
°C
Purinergic receptor P2Y2
(Homo sapiens (Human))
BDBM50195847
(({[({[(2R,3S,4R,5R)-5-(7-fluoro-6-methoxy-1-oxo-1,...)
Show SMILES COc1cc2ccn([C@@H]3O[C@H](COP(O)(=O)OP(O)(=O)OP(O)(O)=O)[C@@H](O)[C@H]3O)c(=O)c2cc1F |w:17.17,13.13|
Show InChI InChI=1S/C15H19FNO15P3/c1-28-10-4-7-2-3-17(14(20)8(7)5-9(10)16)15-13(19)12(18)11(30-15)6-29-34(24,25)32-35(26,27)31-33(21,22)23/h2-5,11-13,15,18-19H,6H2,1H3,(H,24,25)(H,26,27)(H2,21,22,23)/t11-,12-,13-,15-/m1/s1
Reactome pathway
n/an/an/an/a 6n/an/an/an/a
UCB-Group
Curated by ChEMBL
Assay Description
Agonist activity at human P2Y2 receptor expressed in human 1321N1 by FLIPR assay
Bioorg Med Chem Lett 17: 562-5 (2007)
Article DOI: 10.1016/j.bmcl.2006.09.017
BindingDB Entry DOI: 10.7270/Q2CC11JS