BDBM50196102 CHEMBL3953221
SMILES: Cc1ccc2n([C@@H]3CCC[C@@H](C3)NC(=O)C=C)c(NC(=O)c3cccc(c3)C(F)(F)F)nc2c1
InChI Key: InChIKey=JFCPIPVOYQAKKQ-RBUKOAKNSA-N
Data: 1 IC50
Activity Spreadsheet -- Enzyme Inhibition Constant Data from BindingDB
Found 1 hit for monomerid = 50196102
Trg + Lig
Ki
nM
ΔG°
kcal/mole
IC50
nM
Kd
nM
EC50/IC50
nM
koff
s-1
kon
M-1s-1
pHTemp
°C
Epidermal growth factor receptor
(Homo sapiens (Human))
BDBM50196102
(CHEMBL3953221)
Show SMILES Cc1ccc2n([C@@H]3CCC[C@@H](C3)NC(=O)C=C)c(NC(=O)c3cccc(c3)C(F)(F)F)nc2c1 |r|
Show InChI InChI=1S/C25H25F3N4O2/c1-3-22(33)29-18-8-5-9-19(14-18)32-21-11-10-15(2)12-20(21)30-24(32)31-23(34)16-6-4-7-17(13-16)25(26,27)28/h3-4,6-7,10-13,18-19H,1,5,8-9,14H2,2H3,(H,29,33)(H,30,31,34)/t18-,19+/m0/s1
n/an/a>1.00E+4n/an/an/an/an/an/a
Genomics Institute of the Novartis Research Foundation
Curated by ChEMBL
Assay Description
Inhibition of wild type human EGFR phosphorylation expressed in mouse NIH/3T3 cells incubated for 3 hrs by ELISA method
J Med Chem 59: 6671-89 (2016)
Article DOI: 10.1021/acs.jmedchem.5b01985
BindingDB Entry DOI: 10.7270/Q2RF5X00