BDBM50196433 CHEMBL3985323
SMILES: CNC(=N)NCCC[C@H](NC(=O)[C@H](CC(C)C)NC(=O)NNC(=O)[C@H](Cc1ccccc1)NC(=O)[C@@H](NC(=O)[C@H](CC(N)=O)NC(=O)CCNC(=O)[C@@H](Cc1ccc(O)cc1)NC(C)=O)[C@@H](C)O)C(=O)N[C@@H](Cc1c[nH]c2ccccc12)C(N)=O
InChI Key: InChIKey=CCNHAEHVXAPUDE-HTRJDKQHSA-N
Data: 2 EC50
Activity Spreadsheet -- Enzyme Inhibition Constant Data from BindingDB
Found 2 hits for monomerid = 50196433
Trg + Lig
Ki
nM
ΔG°
kcal/mole
IC50
nM
Kd
nM
EC50/IC50
nM
koff
s-1
kon
M-1s-1
pHTemp
°C
KiSS-1 receptor
(Rattus norvegicus)
BDBM50196433
(CHEMBL3985323)
Show SMILES CNC(=N)NCCC[C@H](NC(=O)[C@H](CC(C)C)NC(=O)NNC(=O)[C@H](Cc1ccccc1)NC(=O)[C@@H](NC(=O)[C@H](CC(N)=O)NC(=O)CCNC(=O)[C@@H](Cc1ccc(O)cc1)NC(C)=O)[C@@H](C)O)C(=O)N[C@@H](Cc1c[nH]c2ccccc12)C(N)=O |r|
Show InChI InChI=1S/C56H78N16O13/c1-30(2)24-41(51(81)66-39(16-11-22-62-55(59)60-5)50(80)67-40(48(58)78)27-35-29-63-38-15-10-9-14-37(35)38)69-56(85)72-71-53(83)43(25-33-12-7-6-8-13-33)68-54(84)47(31(3)73)70-52(82)44(28-45(57)76)65-46(77)21-23-61-49(79)42(64-32(4)74)26-34-17-19-36(75)20-18-34/h6-10,12-15,17-20,29-31,39-44,47,63,73,75H,11,16,21-28H2,1-5H3,(H2,57,76)(H2,58,78)(H,61,79)(H,64,74)(H,65,77)(H,66,81)(H,67,80)(H,68,84)(H,70,82)(H,71,83)(H3,59,60,62)(H2,69,72,85)/t31-,39+,40+,41+,42-,43+,44+,47+/m1/s1
Reactome pathway
n/an/an/an/a 11n/an/an/an/a
Takeda Pharmaceutical Company Ltd
Curated by ChEMBL
Assay Description
Agonist activity at rat KISS1R expressed in CHO/dhfr cells assessed as increase in intracellular Ca2+ levels measured for 180 secs by Fluo 3-AM dye b...
J Med Chem 59: 8804-8811 (2016)
Article DOI: 10.1021/acs.jmedchem.6b00379
BindingDB Entry DOI: 10.7270/Q2000425
G-protein Coupled Receptor 54
(Homo sapiens (Human))
BDBM50196433
(CHEMBL3985323)
Show SMILES CNC(=N)NCCC[C@H](NC(=O)[C@H](CC(C)C)NC(=O)NNC(=O)[C@H](Cc1ccccc1)NC(=O)[C@@H](NC(=O)[C@H](CC(N)=O)NC(=O)CCNC(=O)[C@@H](Cc1ccc(O)cc1)NC(C)=O)[C@@H](C)O)C(=O)N[C@@H](Cc1c[nH]c2ccccc12)C(N)=O |r|
Show InChI InChI=1S/C56H78N16O13/c1-30(2)24-41(51(81)66-39(16-11-22-62-55(59)60-5)50(80)67-40(48(58)78)27-35-29-63-38-15-10-9-14-37(35)38)69-56(85)72-71-53(83)43(25-33-12-7-6-8-13-33)68-54(84)47(31(3)73)70-52(82)44(28-45(57)76)65-46(77)21-23-61-49(79)42(64-32(4)74)26-34-17-19-36(75)20-18-34/h6-10,12-15,17-20,29-31,39-44,47,63,73,75H,11,16,21-28H2,1-5H3,(H2,57,76)(H2,58,78)(H,61,79)(H,64,74)(H,65,77)(H,66,81)(H,67,80)(H,68,84)(H,70,82)(H,71,83)(H3,59,60,62)(H2,69,72,85)/t31-,39+,40+,41+,42-,43+,44+,47+/m1/s1
Reactome pathway
n/an/an/an/a 3.30n/an/an/an/a
Takeda Pharmaceutical Company Ltd
Curated by ChEMBL
Assay Description
Agonist activity at human KISS1R expressed in CHO/dhfr cells assessed as increase in intracellular Ca2+ levels measured for 180 secs by Fluo 3-AM dye...
J Med Chem 59: 8804-8811 (2016)
Article DOI: 10.1021/acs.jmedchem.6b00379
BindingDB Entry DOI: 10.7270/Q2000425