BDBM50196447 (2S)-1-[(2S)-2-(2S)-6-oxohexahydro-2-pyridinylcarboxamido]-3-(2-cyclohexyl-1H-imidazolyl)propanoyl]-azalone-2-carboxamide::CHEMBL437735
SMILES: NC(=O)[C@@H]1CCCN1C(=O)[C@H](Cc1cnc([nH]1)C1CCCCC1)NC(=O)[C@@H]1CCCC(=O)N1
InChI Key: InChIKey=QMIJXNVCZSVRKE-BZSNNMDCSA-N
Data: 2 KI  2 EC50
Activity Spreadsheet -- Enzyme Inhibition Constant Data from BindingDB
Found 4 hits for monomerid = 50196447
Trg + Lig
Ki
nM
ΔG°
kcal/mole
IC50
nM
Kd
nM
EC50/IC50
nM
koff
s-1
kon
M-1s-1
pHTemp
°C
Thyrotropin-releasing hormone receptor 2
(Rattus norvegicus)
BDBM50196447
((2S)-1-[(2S)-2-(2S)-6-oxohexahydro-2-pyridinylcarb...)
Show SMILES NC(=O)[C@@H]1CCCN1C(=O)[C@H](Cc1cnc([nH]1)C1CCCCC1)NC(=O)[C@@H]1CCCC(=O)N1
Show InChI InChI=1S/C23H34N6O4/c24-20(31)18-9-5-11-29(18)23(33)17(28-22(32)16-8-4-10-19(30)27-16)12-15-13-25-21(26-15)14-6-2-1-3-7-14/h13-14,16-18H,1-12H2,(H2,24,31)(H,25,26)(H,27,30)(H,28,32)/t16-,17-,18-/m0/s1
>1.00E+5n/an/an/an/an/an/an/an/a
National Institute of Pharmaceutical Education and Research
Curated by ChEMBL
Assay Description
Displacement of [3H]N(1)-Me-His-TRH from TRHR2
Bioorg Med Chem 15: 433-43 (2006)
Article DOI: 10.1016/j.bmc.2006.09.045
BindingDB Entry DOI: 10.7270/Q2ZW1KJV
Thyrotropin-releasing hormone receptor
(Homo sapiens (Human))
BDBM50196447
((2S)-1-[(2S)-2-(2S)-6-oxohexahydro-2-pyridinylcarb...)
Show SMILES NC(=O)[C@@H]1CCCN1C(=O)[C@H](Cc1cnc([nH]1)C1CCCCC1)NC(=O)[C@@H]1CCCC(=O)N1
Show InChI InChI=1S/C23H34N6O4/c24-20(31)18-9-5-11-29(18)23(33)17(28-22(32)16-8-4-10-19(30)27-16)12-15-13-25-21(26-15)14-6-2-1-3-7-14/h13-14,16-18H,1-12H2,(H2,24,31)(H,25,26)(H,27,30)(H,28,32)/t16-,17-,18-/m0/s1
Reactome pathway
>1.00E+5n/an/an/an/an/an/an/an/a
National Institute of Pharmaceutical Education and Research
Curated by ChEMBL
Assay Description
Displacement of [3H]N(1)-Me-His-TRH from TRHR1
Bioorg Med Chem 15: 433-43 (2006)
Article DOI: 10.1016/j.bmc.2006.09.045
BindingDB Entry DOI: 10.7270/Q2ZW1KJV
Thyrotropin-releasing hormone receptor 2
(Rattus norvegicus)
BDBM50196447
((2S)-1-[(2S)-2-(2S)-6-oxohexahydro-2-pyridinylcarb...)
Show SMILES NC(=O)[C@@H]1CCCN1C(=O)[C@H](Cc1cnc([nH]1)C1CCCCC1)NC(=O)[C@@H]1CCCC(=O)N1
Show InChI InChI=1S/C23H34N6O4/c24-20(31)18-9-5-11-29(18)23(33)17(28-22(32)16-8-4-10-19(30)27-16)12-15-13-25-21(26-15)14-6-2-1-3-7-14/h13-14,16-18H,1-12H2,(H2,24,31)(H,25,26)(H,27,30)(H,28,32)/t16-,17-,18-/m0/s1
n/an/an/an/a>1.00E+5n/an/an/an/a
National Institute of Pharmaceutical Education and Research
Curated by ChEMBL
Assay Description
Agonist activity at TRHR2 expressed in HEK293EM cells assessed as activation potency by measuring CREB-luciferase reporter activity
Bioorg Med Chem 15: 433-43 (2006)
Article DOI: 10.1016/j.bmc.2006.09.045
BindingDB Entry DOI: 10.7270/Q2ZW1KJV
Thyrotropin-releasing hormone receptor
(Homo sapiens (Human))
BDBM50196447
((2S)-1-[(2S)-2-(2S)-6-oxohexahydro-2-pyridinylcarb...)
Show SMILES NC(=O)[C@@H]1CCCN1C(=O)[C@H](Cc1cnc([nH]1)C1CCCCC1)NC(=O)[C@@H]1CCCC(=O)N1
Show InChI InChI=1S/C23H34N6O4/c24-20(31)18-9-5-11-29(18)23(33)17(28-22(32)16-8-4-10-19(30)27-16)12-15-13-25-21(26-15)14-6-2-1-3-7-14/h13-14,16-18H,1-12H2,(H2,24,31)(H,25,26)(H,27,30)(H,28,32)/t16-,17-,18-/m0/s1
Reactome pathway
n/an/an/an/a>1.00E+5n/an/an/an/a
National Institute of Pharmaceutical Education and Research
Curated by ChEMBL
Assay Description
Agonist activity at TRHR1 expressed in HEK293EM cells assessed as activation potency by measuring CREB-luciferase reporter activity
Bioorg Med Chem 15: 433-43 (2006)
Article DOI: 10.1016/j.bmc.2006.09.045
BindingDB Entry DOI: 10.7270/Q2ZW1KJV