BDBM50196597 CHEMBL384714::N-hydroxy-7-(4-(methyl(pyridin-4-ylmethyl)amino)phenoxy)heptanamide
SMILES: CN(Cc1ccncc1)c1ccc(OCCCCCCC(=O)NO)cc1
InChI Key: InChIKey=HZALGOAFPDJAFC-UHFFFAOYSA-N
Data: 1 IC50
Activity Spreadsheet -- Enzyme Inhibition Constant Data from BindingDB
Found 1 hit for monomerid = 50196597
Trg + Lig
Ki
nM
ΔG°
kcal/mole
IC50
nM
Kd
nM
EC50/IC50
nM
koff
s-1
kon
M-1s-1
pHTemp
°C
Histone deacetylase 1
(Homo sapiens (Human))
BDBM50196597
(CHEMBL384714 | N-hydroxy-7-(4-(methyl(pyridin-4-yl...)
Show SMILES CN(Cc1ccncc1)c1ccc(OCCCCCCC(=O)NO)cc1
Show InChI InChI=1S/C20H27N3O3/c1-23(16-17-11-13-21-14-12-17)18-7-9-19(10-8-18)26-15-5-3-2-4-6-20(24)22-25/h7-14,25H,2-6,15-16H2,1H3,(H,22,24)
NCI pathway
Reactome pathway
n/an/a 15n/an/an/an/an/an/a
University College London
Curated by ChEMBL
Assay Description
In vitro inhibition of histone deacetylase activity using HeLa cell nuclear extract as enzyme source
Bioorg Med Chem Lett 17: 136-41 (2006)
Article DOI: 10.1016/j.bmcl.2006.09.085
BindingDB Entry DOI: 10.7270/Q2B56JDQ