BDBM50196695 CHEMBL224510::N-(1-(3,4-difluorobenzyl)piperidin-3-yl)-1H-indazol-5-amine::N-[1-(3,4-difluorobenzyl)-3-piperidyl]-N-(1H-5-indazolyl)amine
SMILES: Fc1ccc(CN2CCCC(C2)Nc2ccc3[nH]ncc3c2)cc1F
InChI Key: InChIKey=NVDYRDZHCINQQB-UHFFFAOYSA-N
Data: 2 IC50
Activity Spreadsheet -- Enzyme Inhibition Constant Data from BindingDB
Found 2 hits for monomerid = 50196695
Trg + Lig
Ki
nM
ΔG°
kcal/mole
IC50
nM
Kd
nM
EC50/IC50
nM
koff
s-1
kon
M-1s-1
pHTemp
°C
C-C chemokine receptor type 2
(Homo sapiens (Human))
BDBM50196695
(CHEMBL224510 | N-(1-(3,4-difluorobenzyl)piperidin-...)
Show SMILES Fc1ccc(CN2CCCC(C2)Nc2ccc3[nH]ncc3c2)cc1F
Show InChI InChI=1S/C19H20F2N4/c20-17-5-3-13(8-18(17)21)11-25-7-1-2-16(12-25)23-15-4-6-19-14(9-15)10-22-24-19/h3-6,8-10,16,23H,1-2,7,11-12H2,(H,22,24)
n/an/a 1.00E+3n/an/an/an/an/an/a
Kirin Brewery Co. Ltd
Curated by ChEMBL
Assay Description
Inhibition of MCP1-induced cell migration in U937 cells expressing CCR2 by chemotaxis assay
Bioorg Med Chem 15: 350-64 (2006)
Article DOI: 10.1016/j.bmc.2006.09.052
BindingDB Entry DOI: 10.7270/Q2T43TW5
Rho-associated protein kinase 2/Rho-kinase (ROCK I)
(Homo sapiens (Human))
BDBM50196695
(CHEMBL224510 | N-(1-(3,4-difluorobenzyl)piperidin-...)
Show SMILES Fc1ccc(CN2CCCC(C2)Nc2ccc3[nH]ncc3c2)cc1F
Show InChI InChI=1S/C19H20F2N4/c20-17-5-3-13(8-18(17)21)11-25-7-1-2-16(12-25)23-15-4-6-19-14(9-15)10-22-24-19/h3-6,8-10,16,23H,1-2,7,11-12H2,(H,22,24)
n/an/a 10n/an/an/an/an/an/a
Kirin Brewery Co. Ltd
Curated by ChEMBL
Assay Description
Inhibition of Rho kinase
Bioorg Med Chem 15: 350-64 (2006)
Article DOI: 10.1016/j.bmc.2006.09.052
BindingDB Entry DOI: 10.7270/Q2T43TW5