BDBM50196702 CHEMBL427254::N-(1-(2-aminobenzyl)piperidin-3-yl)-1H-indazol-5-amine::N-[1-(2-aminobenzyl)-3-piperidyl]-N-(1H-5-indazolyl)amine
SMILES: Nc1ccccc1CN1CCCC(C1)Nc1ccc2[nH]ncc2c1
InChI Key: InChIKey=QANOXOWLUOTIAC-UHFFFAOYSA-N
Data: 2 IC50
Activity Spreadsheet -- Enzyme Inhibition Constant Data from BindingDB
Found 2 hits for monomerid = 50196702
Trg + Lig
Ki
nM
ΔG°
kcal/mole
IC50
nM
Kd
nM
EC50/IC50
nM
koff
s-1
kon
M-1s-1
pHTemp
°C
C-C chemokine receptor type 2
(Homo sapiens (Human))
BDBM50196702
(CHEMBL427254 | N-(1-(2-aminobenzyl)piperidin-3-yl)...)
Show SMILES Nc1ccccc1CN1CCCC(C1)Nc1ccc2[nH]ncc2c1
Show InChI InChI=1S/C19H23N5/c20-18-6-2-1-4-14(18)12-24-9-3-5-17(13-24)22-16-7-8-19-15(10-16)11-21-23-19/h1-2,4,6-8,10-11,17,22H,3,5,9,12-13,20H2,(H,21,23)
n/an/a 1.00E+3n/an/an/an/an/an/a
Kirin Brewery Co. Ltd
Curated by ChEMBL
Assay Description
Inhibition of MCP1-induced cell migration in U937 cells expressing CCR2 by chemotaxis assay
Bioorg Med Chem 15: 350-64 (2006)
Article DOI: 10.1016/j.bmc.2006.09.052
BindingDB Entry DOI: 10.7270/Q2T43TW5
Rho-associated protein kinase 2/Rho-kinase (ROCK I)
(Homo sapiens (Human))
BDBM50196702
(CHEMBL427254 | N-(1-(2-aminobenzyl)piperidin-3-yl)...)
Show SMILES Nc1ccccc1CN1CCCC(C1)Nc1ccc2[nH]ncc2c1
Show InChI InChI=1S/C19H23N5/c20-18-6-2-1-4-14(18)12-24-9-3-5-17(13-24)22-16-7-8-19-15(10-16)11-21-23-19/h1-2,4,6-8,10-11,17,22H,3,5,9,12-13,20H2,(H,21,23)
n/an/a 85n/an/an/an/an/an/a
Kirin Brewery Co. Ltd
Curated by ChEMBL
Assay Description
Inhibition of Rho kinase
Bioorg Med Chem 15: 350-64 (2006)
Article DOI: 10.1016/j.bmc.2006.09.052
BindingDB Entry DOI: 10.7270/Q2T43TW5