BDBM50196929 (S)-2,4-diamino-1-((3aR,6aR)-hexahydrocyclopenta[b]pyrrol-1(2H)-yl)butan-1-one::CHEMBL397057
SMILES: NCC[C@H](N)C(=O)N1CC[C@H]2CCC[C@@H]12
InChI Key: InChIKey=NSAIVORPWCLAMZ-KXUCPTDWSA-N
Data: 6 IC50
Activity Spreadsheet -- Enzyme Inhibition Constant Data from BindingDB
Found 6 hits for monomerid = 50196929
Trg + Lig
Ki
nM
ΔG°
kcal/mole
IC50
nM
Kd
nM
EC50/IC50
nM
koff
s-1
kon
M-1s-1
pHTemp
°C
Fibroblast activation protein alpha
(Homo sapiens (Human))
BDBM50196929
((S)-2,4-diamino-1-((3aR,6aR)-hexahydrocyclopenta[b...)
Show SMILES NCC[C@H](N)C(=O)N1CC[C@H]2CCC[C@@H]12
Show InChI InChI=1S/C11H21N3O/c12-6-4-9(13)11(15)14-7-5-8-2-1-3-10(8)14/h8-10H,1-7,12-13H2/t8-,9+,10-/m1/s1
n/an/a>3.30E+4n/an/an/an/an/an/a
Tufts University School of Medicine
Curated by ChEMBL
Assay Description
Inhibition of human FAP
Bioorg Med Chem Lett 17: 507-10 (2007)
Article DOI: 10.1016/j.bmcl.2006.10.012
BindingDB Entry DOI: 10.7270/Q2T43SQH
Dipeptidyl peptidase VIII
(Homo sapiens (Human))
BDBM50196929
((S)-2,4-diamino-1-((3aR,6aR)-hexahydrocyclopenta[b...)
Show SMILES NCC[C@H](N)C(=O)N1CC[C@H]2CCC[C@@H]12
Show InChI InChI=1S/C11H21N3O/c12-6-4-9(13)11(15)14-7-5-8-2-1-3-10(8)14/h8-10H,1-7,12-13H2/t8-,9+,10-/m1/s1
n/an/a>2.00E+4n/an/an/an/an/an/a
Tufts University School of Medicine
Curated by ChEMBL
Assay Description
Inhibition of human DPP8
Bioorg Med Chem Lett 17: 507-10 (2007)
Article DOI: 10.1016/j.bmcl.2006.10.012
BindingDB Entry DOI: 10.7270/Q2T43SQH
Dipeptidyl peptidase 4
(Homo sapiens (Human))
BDBM50196929
((S)-2,4-diamino-1-((3aR,6aR)-hexahydrocyclopenta[b...)
Show SMILES NCC[C@H](N)C(=O)N1CC[C@H]2CCC[C@@H]12
Show InChI InChI=1S/C11H21N3O/c12-6-4-9(13)11(15)14-7-5-8-2-1-3-10(8)14/h8-10H,1-7,12-13H2/t8-,9+,10-/m1/s1
Reactome pathway
n/an/a>3.30E+4n/an/an/an/an/an/a
Tufts University School of Medicine
Curated by ChEMBL
Assay Description
Inhibition of human DPP4
Bioorg Med Chem Lett 17: 507-10 (2007)
Article DOI: 10.1016/j.bmcl.2006.10.012
BindingDB Entry DOI: 10.7270/Q2T43SQH
Prolyl endopeptidase
(Homo sapiens (Human))
BDBM50196929
((S)-2,4-diamino-1-((3aR,6aR)-hexahydrocyclopenta[b...)
Show SMILES NCC[C@H](N)C(=O)N1CC[C@H]2CCC[C@@H]12
Show InChI InChI=1S/C11H21N3O/c12-6-4-9(13)11(15)14-7-5-8-2-1-3-10(8)14/h8-10H,1-7,12-13H2/t8-,9+,10-/m1/s1
n/an/a>2.00E+4n/an/an/an/an/an/a
Tufts University School of Medicine
Curated by ChEMBL
Assay Description
Inhibition of prolyl oligopeptidase
Bioorg Med Chem Lett 17: 507-10 (2007)
Article DOI: 10.1016/j.bmcl.2006.10.012
BindingDB Entry DOI: 10.7270/Q2T43SQH
Dipeptidyl peptidase 2 (DPP II)
(Homo sapiens (Human))
BDBM50196929
((S)-2,4-diamino-1-((3aR,6aR)-hexahydrocyclopenta[b...)
Show SMILES NCC[C@H](N)C(=O)N1CC[C@H]2CCC[C@@H]12
Show InChI InChI=1S/C11H21N3O/c12-6-4-9(13)11(15)14-7-5-8-2-1-3-10(8)14/h8-10H,1-7,12-13H2/t8-,9+,10-/m1/s1
n/an/a 0.880n/an/an/an/an/an/a
Tufts University School of Medicine
Curated by ChEMBL
Assay Description
Inhibition of human DPP2
Bioorg Med Chem Lett 17: 507-10 (2007)
Article DOI: 10.1016/j.bmcl.2006.10.012
BindingDB Entry DOI: 10.7270/Q2T43SQH
Dipeptidyl peptidase 9
(Homo sapiens (Human))
BDBM50196929
((S)-2,4-diamino-1-((3aR,6aR)-hexahydrocyclopenta[b...)
Show SMILES NCC[C@H](N)C(=O)N1CC[C@H]2CCC[C@@H]12
Show InChI InChI=1S/C11H21N3O/c12-6-4-9(13)11(15)14-7-5-8-2-1-3-10(8)14/h8-10H,1-7,12-13H2/t8-,9+,10-/m1/s1
n/an/a>2.00E+4n/an/an/an/an/an/a
Tufts University School of Medicine
Curated by ChEMBL
Assay Description
Inhibition of human DPP9
Bioorg Med Chem Lett 17: 507-10 (2007)
Article DOI: 10.1016/j.bmcl.2006.10.012
BindingDB Entry DOI: 10.7270/Q2T43SQH