BDBM50197067 CHEMBL3913746
SMILES: CC(C)(O)CNc1ncc(c(CC2CC2)n1)-c1ccnc(Nc2ccnc(Cl)c2)n1
InChI Key: InChIKey=AWNXKZVIZARMME-UHFFFAOYSA-N
Data: 5 IC50
Activity Spreadsheet -- Enzyme Inhibition Constant Data from BindingDB
Found 5 hits for monomerid = 50197067
Trg + Lig
Ki
nM
ΔG°
kcal/mole
IC50
nM
Kd
nM
EC50/IC50
nM
koff
s-1
kon
M-1s-1
pHTemp
°C
Phosphatidylinositol 3-kinase catalytic subunit type 3
(Homo sapiens (Human))
BDBM50197067
(CHEMBL3913746)
Show SMILES CC(C)(O)CNc1ncc(c(CC2CC2)n1)-c1ccnc(Nc2ccnc(Cl)c2)n1
Show InChI InChI=1S/C21H24ClN7O/c1-21(2,30)12-26-19-25-11-15(17(29-19)9-13-3-4-13)16-6-8-24-20(28-16)27-14-5-7-23-18(22)10-14/h5-8,10-11,13,30H,3-4,9,12H2,1-2H3,(H,25,26,29)(H,23,24,27,28)
Reactome pathway
n/an/a 76n/an/an/an/an/an/a
Curtin University
Curated by ChEMBL
Assay Description
Inhibition of Vps34 (unknown origin)
J Med Chem 60: 47-65 (2017)
Article DOI: 10.1021/acs.jmedchem.6b00963
BindingDB Entry DOI: 10.7270/Q2PG1TPX
Phosphatidylinositol-4-phosphate 3-kinase C2 domain-containing subunit gamma
(Homo sapiens (Human))
BDBM50197067
(CHEMBL3913746)
Show SMILES CC(C)(O)CNc1ncc(c(CC2CC2)n1)-c1ccnc(Nc2ccnc(Cl)c2)n1
Show InChI InChI=1S/C21H24ClN7O/c1-21(2,30)12-26-19-25-11-15(17(29-19)9-13-3-4-13)16-6-8-24-20(28-16)27-14-5-7-23-18(22)10-14/h5-8,10-11,13,30H,3-4,9,12H2,1-2H3,(H,25,26,29)(H,23,24,27,28)
Reactome pathway
n/an/a>1.00E+4n/an/an/an/an/an/a
Curtin University
Curated by ChEMBL
Assay Description
Inhibition of PI3KC2gamma (unknown origin)
J Med Chem 60: 47-65 (2017)
Article DOI: 10.1021/acs.jmedchem.6b00963
BindingDB Entry DOI: 10.7270/Q2PG1TPX
Phosphatidylinositol 3-kinase catalytic subunit type 3
(Homo sapiens (Human))
BDBM50197067
(CHEMBL3913746)
Show SMILES CC(C)(O)CNc1ncc(c(CC2CC2)n1)-c1ccnc(Nc2ccnc(Cl)c2)n1
Show InChI InChI=1S/C21H24ClN7O/c1-21(2,30)12-26-19-25-11-15(17(29-19)9-13-3-4-13)16-6-8-24-20(28-16)27-14-5-7-23-18(22)10-14/h5-8,10-11,13,30H,3-4,9,12H2,1-2H3,(H,25,26,29)(H,23,24,27,28)
Reactome pathway
n/an/a 25n/an/an/an/an/an/a
China Pharmaceutical University
Curated by ChEMBL
Assay Description
Inhibition of Vps34 (unknown origin)
J Med Chem 61: 4656-4687 (2018)
Article DOI: 10.1021/acs.jmedchem.7b01019
Phosphatidylinositol 4-phosphate 3-kinase C2 domain-containing subunit alpha
(Homo sapiens (Human))
BDBM50197067
(CHEMBL3913746)
Show SMILES CC(C)(O)CNc1ncc(c(CC2CC2)n1)-c1ccnc(Nc2ccnc(Cl)c2)n1
Show InChI InChI=1S/C21H24ClN7O/c1-21(2,30)12-26-19-25-11-15(17(29-19)9-13-3-4-13)16-6-8-24-20(28-16)27-14-5-7-23-18(22)10-14/h5-8,10-11,13,30H,3-4,9,12H2,1-2H3,(H,25,26,29)(H,23,24,27,28)
n/an/a>1.00E+4n/an/an/an/an/an/a
Curtin University
Curated by ChEMBL
Assay Description
Inhibition of PI3KC2alpha (unknown origin)
J Med Chem 60: 47-65 (2017)
Article DOI: 10.1021/acs.jmedchem.6b00963
BindingDB Entry DOI: 10.7270/Q2PG1TPX
Phosphatidylinositol 4-phosphate 3-kinase C2 domain-containing subunit beta
(Homo sapiens (Human))
BDBM50197067
(CHEMBL3913746)
Show SMILES CC(C)(O)CNc1ncc(c(CC2CC2)n1)-c1ccnc(Nc2ccnc(Cl)c2)n1
Show InChI InChI=1S/C21H24ClN7O/c1-21(2,30)12-26-19-25-11-15(17(29-19)9-13-3-4-13)16-6-8-24-20(28-16)27-14-5-7-23-18(22)10-14/h5-8,10-11,13,30H,3-4,9,12H2,1-2H3,(H,25,26,29)(H,23,24,27,28)
NCI pathway
Reactome pathway
n/an/a>1.00E+4n/an/an/an/an/an/a
Curtin University
Curated by ChEMBL
Assay Description
Inhibition of PI3KC2beta (unknown origin)
J Med Chem 60: 47-65 (2017)
Article DOI: 10.1021/acs.jmedchem.6b00963
BindingDB Entry DOI: 10.7270/Q2PG1TPX