BDBM50197120 CHEMBL217593::N-[1-[(4-methoxybenzyl)methyl]piperidin-4-yl]-7-fluoro-4-oxo-4H-chromene-2-carboxamide
SMILES: COc1ccc(CN2CCC(CC2)NC(=O)c2cc(=O)c3ccc(F)cc3o2)cc1
InChI Key: InChIKey=MZNNAIHCWWROJM-UHFFFAOYSA-N
Data: 3 IC50
Activity Spreadsheet -- Enzyme Inhibition Constant Data from BindingDB
Found 3 hits for monomerid = 50197120
Trg + Lig
Ki
nM
ΔG°
kcal/mole
IC50
nM
Kd
nM
EC50/IC50
nM
koff
s-1
kon
M-1s-1
pHTemp
°C
Melanin-concentrating hormone receptor
(Homo sapiens (Human))
BDBM50197120
(CHEMBL217593 | N-[1-[(4-methoxybenzyl)methyl]piper...)
Show SMILES COc1ccc(CN2CCC(CC2)NC(=O)c2cc(=O)c3ccc(F)cc3o2)cc1
Show InChI InChI=1S/C23H23FN2O4/c1-29-18-5-2-15(3-6-18)14-26-10-8-17(9-11-26)25-23(28)22-13-20(27)19-7-4-16(24)12-21(19)30-22/h2-7,12-13,17H,8-11,14H2,1H3,(H,25,28)
Reactome pathway
n/an/a 13n/an/an/an/an/an/a
Abbott Laboratories
Curated by ChEMBL
Assay Description
Displacement of [125I]MCH from MCHr1 expressed in IMR32 cells
J Med Chem 49: 6569-84 (2006)
Article DOI: 10.1021/jm060683e
BindingDB Entry DOI: 10.7270/Q2NG4Q7P
Melanin-concentrating hormone receptor
(Homo sapiens (Human))
BDBM50197120
(CHEMBL217593 | N-[1-[(4-methoxybenzyl)methyl]piper...)
Show SMILES COc1ccc(CN2CCC(CC2)NC(=O)c2cc(=O)c3ccc(F)cc3o2)cc1
Show InChI InChI=1S/C23H23FN2O4/c1-29-18-5-2-15(3-6-18)14-26-10-8-17(9-11-26)25-23(28)22-13-20(27)19-7-4-16(24)12-21(19)30-22/h2-7,12-13,17H,8-11,14H2,1H3,(H,25,28)
Reactome pathway
n/an/a 101n/an/an/an/an/an/a
Abbott Laboratories
Curated by ChEMBL
Assay Description
Antagonist activity at MCHr1 assessed as inhibition of MCH-mediated calcium ion release in intact IMR32 cells by FLIPR assay
J Med Chem 49: 6569-84 (2006)
Article DOI: 10.1021/jm060683e
BindingDB Entry DOI: 10.7270/Q2NG4Q7P
Potassium voltage-gated channel subfamily H member 2
(Homo sapiens (Human))
BDBM50197120
(CHEMBL217593 | N-[1-[(4-methoxybenzyl)methyl]piper...)
Show SMILES COc1ccc(CN2CCC(CC2)NC(=O)c2cc(=O)c3ccc(F)cc3o2)cc1
Show InChI InChI=1S/C23H23FN2O4/c1-29-18-5-2-15(3-6-18)14-26-10-8-17(9-11-26)25-23(28)22-13-20(27)19-7-4-16(24)12-21(19)30-22/h2-7,12-13,17H,8-11,14H2,1H3,(H,25,28)
Reactome pathway
n/an/a 5.40n/an/an/an/an/an/a
Abbott Laboratories
Curated by ChEMBL
Assay Description
Displacement of [3H]dofetilide from hERG
J Med Chem 49: 6569-84 (2006)
Article DOI: 10.1021/jm060683e
BindingDB Entry DOI: 10.7270/Q2NG4Q7P