null
SMILES: Fc1ccc2c(c1)oc(cc2=O)C(=O)NC1CCN(Cc2cc3OCOc3cc2Cl)CC1
InChI Key: InChIKey=MHZCWVOMNJUVMC-UHFFFAOYSA-N
Activity Spreadsheet -- Enzyme Inhibition Constant Data from BindingDB
Found 3 hits for monomerid = 50197146
Trg + Lig
Ki
nM
ΔG°
kcal/mole
IC50
nM
Kd
nM
EC50/IC50
nM
koff
s-1
kon
M-1s-1
pHTemp
°C
Potassium voltage-gated channel subfamily H member 2
(Homo sapiens (Human))
BDBM50197146
(CHEMBL217105 | N-{1-[(6-chloro-1,3-benzodioxol-5-y...)
Show SMILES Fc1ccc2c(c1)oc(cc2=O)C(=O)NC1CCN(Cc2cc3OCOc3cc2Cl)CC1
Show InChI InChI=1S/C23H20ClFN2O5/c24-17-9-21-20(30-12-31-21)7-13(17)11-27-5-3-15(4-6-27)26-23(29)22-10-18(28)16-2-1-14(25)8-19(16)32-22/h1-2,7-10,15H,3-6,11-12H2,(H,26,29)
Reactome pathway
n/an/a 13.5n/an/an/an/an/an/a
Abbott Laboratories
Curated by ChEMBL
Assay Description
Displacement of [3H]dofetilide from hERG
J Med Chem 49: 6569-84 (2006)
Article DOI: 10.1021/jm060683e
BindingDB Entry DOI: 10.7270/Q2NG4Q7P
Melanin-concentrating hormone receptor 1
(Homo sapiens (Human))
BDBM50197146
(CHEMBL217105 | N-{1-[(6-chloro-1,3-benzodioxol-5-y...)
Show SMILES Fc1ccc2c(c1)oc(cc2=O)C(=O)NC1CCN(Cc2cc3OCOc3cc2Cl)CC1
Show InChI InChI=1S/C23H20ClFN2O5/c24-17-9-21-20(30-12-31-21)7-13(17)11-27-5-3-15(4-6-27)26-23(29)22-10-18(28)16-2-1-14(25)8-19(16)32-22/h1-2,7-10,15H,3-6,11-12H2,(H,26,29)
Reactome pathway
n/an/a 266n/an/an/an/an/an/a
Abbott Laboratories
Curated by ChEMBL
Assay Description
Antagonist activity at MCHr1 assessed as inhibition of MCH-mediated calcium ion release in intact IMR32 cells by FLIPR assay
J Med Chem 49: 6569-84 (2006)
Article DOI: 10.1021/jm060683e
BindingDB Entry DOI: 10.7270/Q2NG4Q7P
Melanin-concentrating hormone receptor 1
(Homo sapiens (Human))
BDBM50197146
(CHEMBL217105 | N-{1-[(6-chloro-1,3-benzodioxol-5-y...)
Show SMILES Fc1ccc2c(c1)oc(cc2=O)C(=O)NC1CCN(Cc2cc3OCOc3cc2Cl)CC1
Show InChI InChI=1S/C23H20ClFN2O5/c24-17-9-21-20(30-12-31-21)7-13(17)11-27-5-3-15(4-6-27)26-23(29)22-10-18(28)16-2-1-14(25)8-19(16)32-22/h1-2,7-10,15H,3-6,11-12H2,(H,26,29)
Reactome pathway
n/an/a 22n/an/an/an/an/an/a
Abbott Laboratories
Curated by ChEMBL
Assay Description
Displacement of [125I]MCH from MCHr1 expressed in IMR32 cells
J Med Chem 49: 6569-84 (2006)
Article DOI: 10.1021/jm060683e
BindingDB Entry DOI: 10.7270/Q2NG4Q7P