BDBM50197228 4-((4-(but-2-ynyloxy)phenylsulfonyl)methyl)-1-(2,5-dichlorothiophen-3-ylsulfonyl)-N-hydroxypiperidine-4-carboxamide::CHEMBL234776
SMILES: CC#CCOc1ccc(cc1)S(=O)(=O)CC1(CCN(CC1)S(=O)(=O)c1cc(Cl)sc1Cl)C(=O)NO
InChI Key: InChIKey=PRHFUFABVIQNBK-UHFFFAOYSA-N
Data: 3 IC50
Activity Spreadsheet -- Enzyme Inhibition Constant Data from BindingDB
Found 3 hits for monomerid = 50197228
Trg + Lig
Ki
nM
ΔG°
kcal/mole
IC50
nM
Kd
nM
EC50/IC50
nM
koff
s-1
kon
M-1s-1
pHTemp
°C
Disintegrin and metalloproteinase domain-containing protein 17
(Homo sapiens (Human))
BDBM50197228
(4-((4-(but-2-ynyloxy)phenylsulfonyl)methyl)-1-(2,5...)
Show SMILES CC#CCOc1ccc(cc1)S(=O)(=O)CC1(CCN(CC1)S(=O)(=O)c1cc(Cl)sc1Cl)C(=O)NO
Show InChI InChI=1S/C21H22Cl2N2O7S3/c1-2-3-12-32-15-4-6-16(7-5-15)34(28,29)14-21(20(26)24-27)8-10-25(11-9-21)35(30,31)17-13-18(22)33-19(17)23/h4-7,13,27H,8-12,14H2,1H3,(H,24,26)
Reactome pathway
n/an/a<1n/an/an/an/an/an/a
Wyeth Research
Curated by ChEMBL
Assay Description
Inhibition of TACE
Bioorg Med Chem Lett 17: 34-9 (2006)
Article DOI: 10.1016/j.bmcl.2006.10.004
BindingDB Entry DOI: 10.7270/Q2862G2M
Collagenase 3
(Homo sapiens (Human))
BDBM50197228
(4-((4-(but-2-ynyloxy)phenylsulfonyl)methyl)-1-(2,5...)
Show SMILES CC#CCOc1ccc(cc1)S(=O)(=O)CC1(CCN(CC1)S(=O)(=O)c1cc(Cl)sc1Cl)C(=O)NO
Show InChI InChI=1S/C21H22Cl2N2O7S3/c1-2-3-12-32-15-4-6-16(7-5-15)34(28,29)14-21(20(26)24-27)8-10-25(11-9-21)35(30,31)17-13-18(22)33-19(17)23/h4-7,13,27H,8-12,14H2,1H3,(H,24,26)
NCI pathway
Reactome pathway
n/an/a 23n/an/an/an/an/an/a
Wyeth Research
Curated by ChEMBL
Assay Description
Inhibition of MMP13
Bioorg Med Chem Lett 17: 34-9 (2006)
Article DOI: 10.1016/j.bmcl.2006.10.004
BindingDB Entry DOI: 10.7270/Q2862G2M
72 kDa type IV collagenase
(Homo sapiens (Human))
BDBM50197228
(4-((4-(but-2-ynyloxy)phenylsulfonyl)methyl)-1-(2,5...)
Show SMILES CC#CCOc1ccc(cc1)S(=O)(=O)CC1(CCN(CC1)S(=O)(=O)c1cc(Cl)sc1Cl)C(=O)NO
Show InChI InChI=1S/C21H22Cl2N2O7S3/c1-2-3-12-32-15-4-6-16(7-5-15)34(28,29)14-21(20(26)24-27)8-10-25(11-9-21)35(30,31)17-13-18(22)33-19(17)23/h4-7,13,27H,8-12,14H2,1H3,(H,24,26)
Reactome pathway
n/an/a 22n/an/an/an/an/an/a
Wyeth Research
Curated by ChEMBL
Assay Description
Inhibition of MMP2
Bioorg Med Chem Lett 17: 34-9 (2006)
Article DOI: 10.1016/j.bmcl.2006.10.004
BindingDB Entry DOI: 10.7270/Q2862G2M