BDBM50197751 (2E)-2-{2-[(4-chlorobenzyl)oxy]benzylidene}hydrazinecarboximidamide::CHEMBL449045
SMILES: [#7]\[#6](-[#7])=[#7]\[#7]=[#6]-c1ccccc1-[#8]-[#6]-c1ccc(Cl)cc1
InChI Key: InChIKey=QLZIJPLTRJOVDN-UHFFFAOYSA-N
Data: 1 KI  1 IC50
Activity Spreadsheet -- Enzyme Inhibition Constant Data from BindingDB
Found 2 hits for monomerid = 50197751
Trg + Lig
Ki
nM
ΔG°
kcal/mole
IC50
nM
Kd
nM
EC50/IC50
nM
koff
s-1
kon
M-1s-1
pHTemp
°C
Homo sapiens furin (paired basic amino acid cleaving enzyme) (FURIN), mRNA
(Homo sapiens (Human))
BDBM50197751
((2E)-2-{2-[(4-chlorobenzyl)oxy]benzylidene}hydrazi...)
Show SMILES [#7]\[#6](-[#7])=[#7]\[#7]=[#6]-c1ccccc1-[#8]-[#6]-c1ccc(Cl)cc1 |w:5.5|
Show InChI InChI=1S/C15H15ClN4O/c16-13-7-5-11(6-8-13)10-21-14-4-2-1-3-12(14)9-19-20-15(17)18/h1-9H,10H2,(H4,17,18,20)
1.18E+4n/an/an/an/an/an/an/an/a
Philipps University Marburg
Curated by ChEMBL
Assay Description
Inhibition of human recombinant furin by fluorescence plate reader analysis
Bioorg Med Chem Lett 21: 836-40 (2011)
Article DOI: 10.1016/j.bmcl.2010.11.092
BindingDB Entry DOI: 10.7270/Q2F1900D
C-C chemokine receptor type 5
(Homo sapiens (Human))
BDBM50197751
((2E)-2-{2-[(4-chlorobenzyl)oxy]benzylidene}hydrazi...)
Show SMILES [#7]\[#6](-[#7])=[#7]\[#7]=[#6]-c1ccccc1-[#8]-[#6]-c1ccc(Cl)cc1 |w:5.5|
Show InChI InChI=1S/C15H15ClN4O/c16-13-7-5-11(6-8-13)10-21-14-4-2-1-3-12(14)9-19-20-15(17)18/h1-9H,10H2,(H4,17,18,20)
n/an/a>3.00E+4n/an/an/an/an/an/a
Berlex Biosciences
Curated by ChEMBL
Assay Description
Displacement of [125I]MIP1alpha from human CCR5/CD4 expressed in HEK293 cells
Bioorg Med Chem Lett 17: 231-4 (2006)
Article DOI: 10.1016/j.bmcl.2006.09.052
BindingDB Entry DOI: 10.7270/Q2FQ9W8N