BDBM50197958 CHEMBL3979367
SMILES: CC(C)[C@@]12CC[C@@](C)(O1)[C@H](CC\C(C)=C\CC\C(C)=C\C2)OC(C)=O
InChI Key: InChIKey=HVBACKJYWZTKCA-XSLBTUIJSA-N
Data: 3 IC50  2 EC50
Activity Spreadsheet -- Enzyme Inhibition Constant Data from BindingDB
Found 5 hits for monomerid = 50197958
Trg + Lig
Ki
nM
ΔG°
kcal/mole
IC50
nM
Kd
nM
EC50/IC50
nM
koff
s-1
kon
M-1s-1
pHTemp
°C
Signal transducer and activator of transcription 3
(Homo sapiens (Human))
BDBM50197958
(CHEMBL3979367)
Show SMILES CC(C)[C@@]12CC[C@@](C)(O1)[C@H](CC\C(C)=C\CC\C(C)=C\C2)OC(C)=O |r,t:14,19|
Show InChI InChI=1S/C22H36O3/c1-16(2)22-13-12-18(4)9-7-8-17(3)10-11-20(24-19(5)23)21(6,25-22)14-15-22/h8,12,16,20H,7,9-11,13-15H2,1-6H3/b17-8+,18-12+/t20-,21+,22+/m0/s1
n/an/a>5.00E+4n/an/an/an/an/an/a
Universit£ del Piemonte Orientale
Curated by ChEMBL
Assay Description
Inhibition of IFNgamma-induced STAT3 activation in human HeLa cells expressing STAT3 (unknown origin) preincubated for 15 mins followed by IFN-gamma ...
J Nat Prod 79: 1762-8 (2016)
Article DOI: 10.1021/acs.jnatprod.6b00141
BindingDB Entry DOI: 10.7270/Q2PC34BW
Transient receptor potential cation channel subfamily V member 3
(Mus musculus)
BDBM50197958
(CHEMBL3979367)
Show SMILES CC(C)[C@@]12CC[C@@](C)(O1)[C@H](CC\C(C)=C\CC\C(C)=C\C2)OC(C)=O |r,t:14,19|
Show InChI InChI=1S/C22H36O3/c1-16(2)22-13-12-18(4)9-7-8-17(3)10-11-20(24-19(5)23)21(6,25-22)14-15-22/h8,12,16,20H,7,9-11,13-15H2,1-6H3/b17-8+,18-12+/t20-,21+,22+/m0/s1
n/an/an/an/a 1.60E+4n/an/an/an/a
Universit£ del Piemonte Orientale
Curated by ChEMBL
Assay Description
Agonist activity at mouse YFP-tagged TRPV3 expressed in HEK293 cells assessed as increase in calcium influx by Fluo-2-AM dye based microscopic analys...
J Nat Prod 79: 1762-8 (2016)
Article DOI: 10.1021/acs.jnatprod.6b00141
BindingDB Entry DOI: 10.7270/Q2PC34BW
Heat sensitive channel TRPV3
(Rattus norvegicus)
BDBM50197958
(CHEMBL3979367)
Show SMILES CC(C)[C@@]12CC[C@@](C)(O1)[C@H](CC\C(C)=C\CC\C(C)=C\C2)OC(C)=O |r,t:14,19|
Show InChI InChI=1S/C22H36O3/c1-16(2)22-13-12-18(4)9-7-8-17(3)10-11-20(24-19(5)23)21(6,25-22)14-15-22/h8,12,16,20H,7,9-11,13-15H2,1-6H3/b17-8+,18-12+/t20-,21+,22+/m0/s1
n/an/an/an/a 1.40E+3n/an/an/an/a
Universit£ del Piemonte Orientale
Curated by ChEMBL
Assay Description
Activation of rat TRPV3 overexpressed in HEK293 cells assessed as increase in 2-aminoethoxydiphenyl borate-induced intracellular calcium concentratio...
J Nat Prod 79: 1762-8 (2016)
Article DOI: 10.1021/acs.jnatprod.6b00141
BindingDB Entry DOI: 10.7270/Q2PC34BW
Nuclear factor NF-kappa-B
(Homo sapiens (Human))
BDBM50197958
(CHEMBL3979367)
Show SMILES CC(C)[C@@]12CC[C@@](C)(O1)[C@H](CC\C(C)=C\CC\C(C)=C\C2)OC(C)=O |r,t:14,19|
Show InChI InChI=1S/C22H36O3/c1-16(2)22-13-12-18(4)9-7-8-17(3)10-11-20(24-19(5)23)21(6,25-22)14-15-22/h8,12,16,20H,7,9-11,13-15H2,1-6H3/b17-8+,18-12+/t20-,21+,22+/m0/s1
n/an/a>1.00E+5n/an/an/an/an/an/a
Universit£ del Piemonte Orientale
Curated by ChEMBL
Assay Description
Inhibition of NFkappaB p65 activation (unknown origin) expressed in human HeLa cells assessed as inhibition of TNFalpha-induced NFkappaB p65 nuclear ...
J Nat Prod 79: 1762-8 (2016)
Article DOI: 10.1021/acs.jnatprod.6b00141
BindingDB Entry DOI: 10.7270/Q2PC34BW
Heat sensitive channel TRPV3
(Rattus norvegicus)
BDBM50197958
(CHEMBL3979367)
Show SMILES CC(C)[C@@]12CC[C@@](C)(O1)[C@H](CC\C(C)=C\CC\C(C)=C\C2)OC(C)=O |r,t:14,19|
Show InChI InChI=1S/C22H36O3/c1-16(2)22-13-12-18(4)9-7-8-17(3)10-11-20(24-19(5)23)21(6,25-22)14-15-22/h8,12,16,20H,7,9-11,13-15H2,1-6H3/b17-8+,18-12+/t20-,21+,22+/m0/s1
n/an/a 2.20E+3n/an/an/an/an/an/a
Universit£ del Piemonte Orientale
Curated by ChEMBL
Assay Description
Antagonist activity at rat TRPV3 overexpressed in HEK293 cells assessed as inhibition of thymol-induced increase in intracellular Ca2+ levels preincu...
J Nat Prod 79: 1762-8 (2016)
Article DOI: 10.1021/acs.jnatprod.6b00141
BindingDB Entry DOI: 10.7270/Q2PC34BW