null
SMILES: CC(C)[C@]1(O)CC\C(C)=C\CC\C(C)=C\CC\C(C)=C\C1
InChI Key: InChIKey=ZVWXZFYWLABNOW-UYSOGGTPSA-N
Activity Spreadsheet -- Enzyme Inhibition Constant Data from BindingDB
Found 3 hits for monomerid = 50197959
Trg + Lig
Ki
nM
ΔG°
kcal/mole
IC50
nM
Kd
nM
EC50/IC50
nM
koff
s-1
kon
M-1s-1
pHTemp
°C
Signal transducer and activator of transcription 3
(Homo sapiens (Human))
BDBM50197959
(CHEMBL3943485)
Show SMILES CC(C)[C@]1(O)CC\C(C)=C\CC\C(C)=C\CC\C(C)=C\C1 |r,t:8,13,18|
Show InChI InChI=1S/C20H34O/c1-16(2)20(21)14-12-18(4)10-6-8-17(3)9-7-11-19(5)13-15-20/h8,11-12,16,21H,6-7,9-10,13-15H2,1-5H3/b17-8+,18-12+,19-11+/t20-/m1/s1
n/an/a>5.00E+4n/an/an/an/an/an/a
Universit£ del Piemonte Orientale
Curated by ChEMBL
Assay Description
Inhibition of IFNgamma-induced STAT3 activation in human HeLa cells expressing STAT3 (unknown origin) preincubated for 15 mins followed by IFN-gamma ...
J Nat Prod 79: 1762-8 (2016)
Article DOI: 10.1021/acs.jnatprod.6b00141
BindingDB Entry DOI: 10.7270/Q2PC34BW
Heat sensitive channel TRPV3
(Rattus norvegicus)
BDBM50197959
(CHEMBL3943485)
Show SMILES CC(C)[C@]1(O)CC\C(C)=C\CC\C(C)=C\CC\C(C)=C\C1 |r,t:8,13,18|
Show InChI InChI=1S/C20H34O/c1-16(2)20(21)14-12-18(4)10-6-8-17(3)9-7-11-19(5)13-15-20/h8,11-12,16,21H,6-7,9-10,13-15H2,1-5H3/b17-8+,18-12+,19-11+/t20-/m1/s1
n/an/an/an/a 170n/an/an/an/a
Universit£ del Piemonte Orientale
Curated by ChEMBL
Assay Description
Activation of rat TRPV3 overexpressed in HEK293 cells assessed as increase in 2-aminoethoxydiphenyl borate-induced intracellular calcium concentratio...
J Nat Prod 79: 1762-8 (2016)
Article DOI: 10.1021/acs.jnatprod.6b00141
BindingDB Entry DOI: 10.7270/Q2PC34BW
Heat sensitive channel TRPV3
(Rattus norvegicus)
BDBM50197959
(CHEMBL3943485)
Show SMILES CC(C)[C@]1(O)CC\C(C)=C\CC\C(C)=C\CC\C(C)=C\C1 |r,t:8,13,18|
Show InChI InChI=1S/C20H34O/c1-16(2)20(21)14-12-18(4)10-6-8-17(3)9-7-11-19(5)13-15-20/h8,11-12,16,21H,6-7,9-10,13-15H2,1-5H3/b17-8+,18-12+,19-11+/t20-/m1/s1
n/an/a 150n/an/an/an/an/an/a
Universit£ del Piemonte Orientale
Curated by ChEMBL
Assay Description
Antagonist activity at rat TRPV3 overexpressed in HEK293 cells assessed as inhibition of thymol-induced increase in intracellular Ca2+ levels preincu...
J Nat Prod 79: 1762-8 (2016)
Article DOI: 10.1021/acs.jnatprod.6b00141
BindingDB Entry DOI: 10.7270/Q2PC34BW