BDBM50197960 CHEMBL3931428
SMILES: [H][C@@]12CC\C(C)=C\[C@]3([H])OC(=O)C(C)=C3CC\C(C)=C\CC[C@]1(C)O2
InChI Key: InChIKey=CGAKBBMRMLAYMY-STGNWYMPSA-N
Data: 2 IC50  1 EC50
Activity Spreadsheet -- Enzyme Inhibition Constant Data from BindingDB
Found 3 hits for monomerid = 50197960
Trg + Lig
Ki
nM
ΔG°
kcal/mole
IC50
nM
Kd
nM
EC50/IC50
nM
koff
s-1
kon
M-1s-1
pHTemp
°C
Signal transducer and activator of transcription 3
(Homo sapiens (Human))
BDBM50197960
(CHEMBL3931428)
Show SMILES [H][C@@]12CC\C(C)=C\[C@]3([H])OC(=O)C(C)=C3CC\C(C)=C\CC[C@]1(C)O2 |r,c:13,t:5,19|
Show InChI InChI=1S/C20H28O3/c1-13-6-5-11-20(4)18(23-20)10-8-14(2)12-17-16(9-7-13)15(3)19(21)22-17/h6,12,17-18H,5,7-11H2,1-4H3/b13-6+,14-12+/t17-,18+,20-/m0/s1
n/an/a>5.00E+4n/an/an/an/an/an/a
Universit£ del Piemonte Orientale
Curated by ChEMBL
Assay Description
Inhibition of IFNgamma-induced STAT3 activation in human HeLa cells expressing STAT3 (unknown origin) preincubated for 15 mins followed by IFN-gamma ...
J Nat Prod 79: 1762-8 (2016)
Article DOI: 10.1021/acs.jnatprod.6b00141
BindingDB Entry DOI: 10.7270/Q2PC34BW
Heat sensitive channel TRPV3
(Rattus norvegicus)
BDBM50197960
(CHEMBL3931428)
Show SMILES [H][C@@]12CC\C(C)=C\[C@]3([H])OC(=O)C(C)=C3CC\C(C)=C\CC[C@]1(C)O2 |r,c:13,t:5,19|
Show InChI InChI=1S/C20H28O3/c1-13-6-5-11-20(4)18(23-20)10-8-14(2)12-17-16(9-7-13)15(3)19(21)22-17/h6,12,17-18H,5,7-11H2,1-4H3/b13-6+,14-12+/t17-,18+,20-/m0/s1
n/an/an/an/a 3.01E+4n/an/an/an/a
Universit£ del Piemonte Orientale
Curated by ChEMBL
Assay Description
Activation of rat TRPV3 overexpressed in HEK293 cells assessed as increase in 2-aminoethoxydiphenyl borate-induced intracellular calcium concentratio...
J Nat Prod 79: 1762-8 (2016)
Article DOI: 10.1021/acs.jnatprod.6b00141
BindingDB Entry DOI: 10.7270/Q2PC34BW
Heat sensitive channel TRPV3
(Rattus norvegicus)
BDBM50197960
(CHEMBL3931428)
Show SMILES [H][C@@]12CC\C(C)=C\[C@]3([H])OC(=O)C(C)=C3CC\C(C)=C\CC[C@]1(C)O2 |r,c:13,t:5,19|
Show InChI InChI=1S/C20H28O3/c1-13-6-5-11-20(4)18(23-20)10-8-14(2)12-17-16(9-7-13)15(3)19(21)22-17/h6,12,17-18H,5,7-11H2,1-4H3/b13-6+,14-12+/t17-,18+,20-/m0/s1
n/an/a>1.00E+5n/an/an/an/an/an/a
Universit£ del Piemonte Orientale
Curated by ChEMBL
Assay Description
Antagonist activity at rat TRPV3 overexpressed in HEK293 cells assessed as inhibition of thymol-induced increase in intracellular Ca2+ levels preincu...
J Nat Prod 79: 1762-8 (2016)
Article DOI: 10.1021/acs.jnatprod.6b00141
BindingDB Entry DOI: 10.7270/Q2PC34BW