BDBM50197961 CHEMBL3899770
SMILES: CCCCCCCCC(=O)O[C@H]1CC\C(C)=C\CC\C(C)=C\C[C@@]2(CC[C@@]1(C)O2)C(C)C
InChI Key: InChIKey=RZMCRLYIPXLJDL-VABOSOLWSA-N
Data: 2 IC50  1 EC50
Activity Spreadsheet -- Enzyme Inhibition Constant Data from BindingDB
Found 3 hits for monomerid = 50197961
Trg + Lig
Ki
nM
ΔG°
kcal/mole
IC50
nM
Kd
nM
EC50/IC50
nM
koff
s-1
kon
M-1s-1
pHTemp
°C
Heat sensitive channel TRPV3
(Rattus norvegicus)
BDBM50197961
(CHEMBL3899770)
Show SMILES CCCCCCCCC(=O)O[C@H]1CC\C(C)=C\CC\C(C)=C\C[C@@]2(CC[C@@]1(C)O2)C(C)C |r,t:15,20|
Show InChI InChI=1S/C29H50O3/c1-7-8-9-10-11-12-16-27(30)31-26-18-17-24(4)14-13-15-25(5)19-20-29(23(2)3)22-21-28(26,6)32-29/h14,19,23,26H,7-13,15-18,20-22H2,1-6H3/b24-14+,25-19+/t26-,28+,29+/m0/s1
n/an/an/an/a 5.60E+3n/an/an/an/a
Universit£ del Piemonte Orientale
Curated by ChEMBL
Assay Description
Activation of rat TRPV3 overexpressed in HEK293 cells assessed as increase in 2-aminoethoxydiphenyl borate-induced intracellular calcium concentratio...
J Nat Prod 79: 1762-8 (2016)
Article DOI: 10.1021/acs.jnatprod.6b00141
BindingDB Entry DOI: 10.7270/Q2PC34BW
Heat sensitive channel TRPV3
(Rattus norvegicus)
BDBM50197961
(CHEMBL3899770)
Show SMILES CCCCCCCCC(=O)O[C@H]1CC\C(C)=C\CC\C(C)=C\C[C@@]2(CC[C@@]1(C)O2)C(C)C |r,t:15,20|
Show InChI InChI=1S/C29H50O3/c1-7-8-9-10-11-12-16-27(30)31-26-18-17-24(4)14-13-15-25(5)19-20-29(23(2)3)22-21-28(26,6)32-29/h14,19,23,26H,7-13,15-18,20-22H2,1-6H3/b24-14+,25-19+/t26-,28+,29+/m0/s1
n/an/a 2.41E+4n/an/an/an/an/an/a
Universit£ del Piemonte Orientale
Curated by ChEMBL
Assay Description
Antagonist activity at rat TRPV3 overexpressed in HEK293 cells assessed as inhibition of thymol-induced increase in intracellular Ca2+ levels preincu...
J Nat Prod 79: 1762-8 (2016)
Article DOI: 10.1021/acs.jnatprod.6b00141
BindingDB Entry DOI: 10.7270/Q2PC34BW
Signal transducer and activator of transcription 3
(Homo sapiens (Human))
BDBM50197961
(CHEMBL3899770)
Show SMILES CCCCCCCCC(=O)O[C@H]1CC\C(C)=C\CC\C(C)=C\C[C@@]2(CC[C@@]1(C)O2)C(C)C |r,t:15,20|
Show InChI InChI=1S/C29H50O3/c1-7-8-9-10-11-12-16-27(30)31-26-18-17-24(4)14-13-15-25(5)19-20-29(23(2)3)22-21-28(26,6)32-29/h14,19,23,26H,7-13,15-18,20-22H2,1-6H3/b24-14+,25-19+/t26-,28+,29+/m0/s1
n/an/a 3.87E+4n/an/an/an/an/an/a
Universit£ del Piemonte Orientale
Curated by ChEMBL
Assay Description
Inhibition of IFNgamma-induced STAT3 activation in human HeLa cells expressing STAT3 (unknown origin) preincubated for 15 mins followed by IFN-gamma ...
J Nat Prod 79: 1762-8 (2016)
Article DOI: 10.1021/acs.jnatprod.6b00141
BindingDB Entry DOI: 10.7270/Q2PC34BW