BDBM50197969 CHEMBL3975348
SMILES: [H][C@@]12C[C@@]3(CC[C@@](C)(O3)[C@H](CC\C(C)=C\CC[C@]1(C)O2)OC(C)=O)C(C)C
InChI Key: InChIKey=BYTWGKLYKQGCLX-GTUZTKPESA-N
Data: 2 IC50  1 EC50
Activity Spreadsheet -- Enzyme Inhibition Constant Data from BindingDB
Found 3 hits for monomerid = 50197969
Trg + Lig
Ki
nM
ΔG°
kcal/mole
IC50
nM
Kd
nM
EC50/IC50
nM
koff
s-1
kon
M-1s-1
pHTemp
°C
Heat sensitive channel TRPV3
(Rattus norvegicus)
BDBM50197969
(CHEMBL3975348)
Show SMILES [H][C@@]12C[C@@]3(CC[C@@](C)(O3)[C@H](CC\C(C)=C\CC[C@]1(C)O2)OC(C)=O)C(C)C |r,t:14|
Show InChI InChI=1S/C22H36O4/c1-15(2)22-13-12-21(6,26-22)18(24-17(4)23)10-9-16(3)8-7-11-20(5)19(14-22)25-20/h8,15,18-19H,7,9-14H2,1-6H3/b16-8+/t18-,19+,20-,21+,22-/m0/s1
n/an/a 1.32E+4n/an/an/an/an/an/a
Universit£ del Piemonte Orientale
Curated by ChEMBL
Assay Description
Antagonist activity at rat TRPV3 overexpressed in HEK293 cells assessed as inhibition of thymol-induced increase in intracellular Ca2+ levels preincu...
J Nat Prod 79: 1762-8 (2016)
Article DOI: 10.1021/acs.jnatprod.6b00141
BindingDB Entry DOI: 10.7270/Q2PC34BW
Signal transducer and activator of transcription 3
(Homo sapiens (Human))
BDBM50197969
(CHEMBL3975348)
Show SMILES [H][C@@]12C[C@@]3(CC[C@@](C)(O3)[C@H](CC\C(C)=C\CC[C@]1(C)O2)OC(C)=O)C(C)C |r,t:14|
Show InChI InChI=1S/C22H36O4/c1-15(2)22-13-12-21(6,26-22)18(24-17(4)23)10-9-16(3)8-7-11-20(5)19(14-22)25-20/h8,15,18-19H,7,9-14H2,1-6H3/b16-8+/t18-,19+,20-,21+,22-/m0/s1
n/an/a>5.00E+4n/an/an/an/an/an/a
Universit£ del Piemonte Orientale
Curated by ChEMBL
Assay Description
Inhibition of IFNgamma-induced STAT3 activation in human HeLa cells expressing STAT3 (unknown origin) preincubated for 15 mins followed by IFN-gamma ...
J Nat Prod 79: 1762-8 (2016)
Article DOI: 10.1021/acs.jnatprod.6b00141
BindingDB Entry DOI: 10.7270/Q2PC34BW
Heat sensitive channel TRPV3
(Rattus norvegicus)
BDBM50197969
(CHEMBL3975348)
Show SMILES [H][C@@]12C[C@@]3(CC[C@@](C)(O3)[C@H](CC\C(C)=C\CC[C@]1(C)O2)OC(C)=O)C(C)C |r,t:14|
Show InChI InChI=1S/C22H36O4/c1-15(2)22-13-12-21(6,26-22)18(24-17(4)23)10-9-16(3)8-7-11-20(5)19(14-22)25-20/h8,15,18-19H,7,9-14H2,1-6H3/b16-8+/t18-,19+,20-,21+,22-/m0/s1
n/an/an/an/a 8.80E+3n/an/an/an/a
Universit£ del Piemonte Orientale
Curated by ChEMBL
Assay Description
Activation of rat TRPV3 overexpressed in HEK293 cells assessed as increase in 2-aminoethoxydiphenyl borate-induced intracellular calcium concentratio...
J Nat Prod 79: 1762-8 (2016)
Article DOI: 10.1021/acs.jnatprod.6b00141
BindingDB Entry DOI: 10.7270/Q2PC34BW