BDBM50198043 CHEMBL3983087
SMILES: CCc1ccc(cc1)\N=C1/S\C(=C/c2ccnc(Nc3ccccc3)c2)C(=O)N1C
InChI Key: InChIKey=FKBMGGQMVZLHTN-ZLBPUWNPSA-N
Data: 1 IC50
Activity Spreadsheet -- Enzyme Inhibition Constant Data from BindingDB
Found 1 hit for monomerid = 50198043
Trg + Lig
Ki
nM
ΔG°
kcal/mole
IC50
nM
Kd
nM
EC50/IC50
nM
koff
s-1
kon
M-1s-1
pHTemp
°C
Aurora kinase A
(Homo sapiens (Human))
BDBM50198043
(CHEMBL3983087)
Show SMILES CCc1ccc(cc1)\N=C1/S\C(=C/c2ccnc(Nc3ccccc3)c2)C(=O)N1C
Show InChI InChI=1S/C24H22N4OS/c1-3-17-9-11-20(12-10-17)27-24-28(2)23(29)21(30-24)15-18-13-14-25-22(16-18)26-19-7-5-4-6-8-19/h4-16H,3H2,1-2H3,(H,25,26)/b21-15-,27-24-
NCI pathway
Reactome pathway
n/an/a 600n/an/an/an/an/an/a
University of Berne
Curated by ChEMBL
Assay Description
Inhibition of His-tagged human Aurora A kinase (122 to 40 residues) expressed in Escherichia coli BL21 (DE3) Rosetta cells using biotinylated STK2 su...
J Med Chem 59: 7188-211 (2016)
Article DOI: 10.1021/acs.jmedchem.6b00709
BindingDB Entry DOI: 10.7270/Q2JM2CM5