BDBM50198053 CHEMBL3976213
SMILES: O=c1[nH]c2ccccc2n1-c1nc2ccccc2[nH]1
InChI Key: InChIKey=ZSWQYSJNHWGDPD-UHFFFAOYSA-N
Data: 1 IC50
Activity Spreadsheet -- Enzyme Inhibition Constant Data from BindingDB
Found 1 hit for monomerid = 50198053
Trg + Lig
Ki
nM
ΔG°
kcal/mole
IC50
nM
Kd
nM
EC50/IC50
nM
koff
s-1
kon
M-1s-1
pHTemp
°C
Aurora kinase A
(Homo sapiens (Human))
BDBM50198053
(CHEMBL3976213)
Show SMILES O=c1[nH]c2ccccc2n1-c1nc2ccccc2[nH]1
Show InChI InChI=1S/C14H10N4O/c19-14-17-11-7-3-4-8-12(11)18(14)13-15-9-5-1-2-6-10(9)16-13/h1-8H,(H,15,16)(H,17,19)
NCI pathway
Reactome pathway
n/an/a 6.50E+3n/an/an/an/an/an/a
University of Berne
Curated by ChEMBL
Assay Description
Inhibition of His-tagged human Aurora A kinase (122 to 40 residues) expressed in Escherichia coli BL21 (DE3) Rosetta cells using biotinylated STK2 su...
J Med Chem 59: 7188-211 (2016)
Article DOI: 10.1021/acs.jmedchem.6b00709
BindingDB Entry DOI: 10.7270/Q2JM2CM5