BDBM50198074 CHEMBL3914435
SMILES: CN1\C(S\C(=C/c2ccncc2)C1=O)=N\c1ccc(C)c(C)c1
InChI Key: InChIKey=QEXZTKRHKONCKZ-JTHVCAJSSA-N
Data: 1 IC50
Activity Spreadsheet -- Enzyme Inhibition Constant Data from BindingDB
Found 1 hit for monomerid = 50198074
Trg + Lig
Ki
nM
ΔG°
kcal/mole
IC50
nM
Kd
nM
EC50/IC50
nM
koff
s-1
kon
M-1s-1
pHTemp
°C
Aurora kinase A
(Homo sapiens (Human))
BDBM50198074
(CHEMBL3914435)
Show SMILES CN1\C(S\C(=C/c2ccncc2)C1=O)=N\c1ccc(C)c(C)c1
Show InChI InChI=1S/C18H17N3OS/c1-12-4-5-15(10-13(12)2)20-18-21(3)17(22)16(23-18)11-14-6-8-19-9-7-14/h4-11H,1-3H3/b16-11-,20-18-
NCI pathway
Reactome pathway
n/an/a 2.00E+3n/an/an/an/an/an/a
University of Berne
Curated by ChEMBL
Assay Description
Inhibition of His-tagged human Aurora A kinase (122 to 40 residues) expressed in Escherichia coli BL21 (DE3) Rosetta cells using biotinylated STK2 su...
J Med Chem 59: 7188-211 (2016)
Article DOI: 10.1021/acs.jmedchem.6b00709
BindingDB Entry DOI: 10.7270/Q2JM2CM5