BDBM50198076 CHEMBL3939478
SMILES: CN1\C(S\C(=C/c2ccncc2)C1=O)=N\c1ccc(cc1)C(F)(F)F
InChI Key: InChIKey=SBWZCGURSKPMSJ-WAQMNQRUSA-N
Data: 1 IC50
Activity Spreadsheet -- Enzyme Inhibition Constant Data from BindingDB
Found 1 hit for monomerid = 50198076
Trg + Lig
Ki
nM
ΔG°
kcal/mole
IC50
nM
Kd
nM
EC50/IC50
nM
koff
s-1
kon
M-1s-1
pHTemp
°C
Aurora kinase A
(Homo sapiens (Human))
BDBM50198076
(CHEMBL3939478)
Show SMILES CN1\C(S\C(=C/c2ccncc2)C1=O)=N\c1ccc(cc1)C(F)(F)F
Show InChI InChI=1S/C17H12F3N3OS/c1-23-15(24)14(10-11-6-8-21-9-7-11)25-16(23)22-13-4-2-12(3-5-13)17(18,19)20/h2-10H,1H3/b14-10-,22-16-
NCI pathway
Reactome pathway
n/an/a 370n/an/an/an/an/an/a
University of Berne
Curated by ChEMBL
Assay Description
Inhibition of His-tagged human Aurora A kinase (122 to 40 residues) expressed in Escherichia coli BL21 (DE3) Rosetta cells using biotinylated STK2 su...
J Med Chem 59: 7188-211 (2016)
Article DOI: 10.1021/acs.jmedchem.6b00709
BindingDB Entry DOI: 10.7270/Q2JM2CM5