BDBM50198084 CHEMBL3913242
SMILES: CCc1ccc(cc1)\N=C1/S\C(=C/c2ccnc(Nc3ccccn3)c2)C(=O)N1C
InChI Key: InChIKey=KFKPRIMBMAKQFG-QFMGQSSSSA-N
Data: 1 IC50
Activity Spreadsheet -- Enzyme Inhibition Constant Data from BindingDB
Found 1 hit for monomerid = 50198084
Trg + Lig
Ki
nM
ΔG°
kcal/mole
IC50
nM
Kd
nM
EC50/IC50
nM
koff
s-1
kon
M-1s-1
pHTemp
°C
Aurora kinase A
(Homo sapiens (Human))
BDBM50198084
(CHEMBL3913242)
Show SMILES CCc1ccc(cc1)\N=C1/S\C(=C/c2ccnc(Nc3ccccn3)c2)C(=O)N1C
Show InChI InChI=1S/C23H21N5OS/c1-3-16-7-9-18(10-8-16)26-23-28(2)22(29)19(30-23)14-17-11-13-25-21(15-17)27-20-6-4-5-12-24-20/h4-15H,3H2,1-2H3,(H,24,25,27)/b19-14-,26-23-
NCI pathway
Reactome pathway
n/an/a 220n/an/an/an/an/an/a
University of Berne
Curated by ChEMBL
Assay Description
Inhibition of His-tagged human Aurora A kinase (122 to 40 residues) expressed in Escherichia coli BL21 (DE3) Rosetta cells using biotinylated STK2 su...
J Med Chem 59: 7188-211 (2016)
Article DOI: 10.1021/acs.jmedchem.6b00709
BindingDB Entry DOI: 10.7270/Q2JM2CM5