BDBM50198157 CHEMBL3974813
SMILES: OC(=O)c1ccc2n(-c3nc4ccccc4[nH]3)c(=O)[nH]c2c1
InChI Key: InChIKey=GNEZHCDBBOXVHE-UHFFFAOYSA-N
Data: 1 IC50
Activity Spreadsheet -- Enzyme Inhibition Constant Data from BindingDB
Found 1 hit for monomerid = 50198157
Trg + Lig
Ki
nM
ΔG°
kcal/mole
IC50
nM
Kd
nM
EC50/IC50
nM
koff
s-1
kon
M-1s-1
pHTemp
°C
Aurora kinase A
(Homo sapiens (Human))
BDBM50198157
(CHEMBL3974813)
Show SMILES OC(=O)c1ccc2n(-c3nc4ccccc4[nH]3)c(=O)[nH]c2c1
Show InChI InChI=1S/C15H10N4O3/c20-13(21)8-5-6-12-11(7-8)18-15(22)19(12)14-16-9-3-1-2-4-10(9)17-14/h1-7H,(H,16,17)(H,18,22)(H,20,21)
NCI pathway
Reactome pathway
n/an/a 3.50E+3n/an/an/an/an/an/a
University of Berne
Curated by ChEMBL
Assay Description
Inhibition of His-tagged human Aurora A kinase (122 to 40 residues) expressed in Escherichia coli BL21 (DE3) Rosetta cells using biotinylated STK2 su...
J Med Chem 59: 7188-211 (2016)
Article DOI: 10.1021/acs.jmedchem.6b00709
BindingDB Entry DOI: 10.7270/Q2JM2CM5