BDBM50198159 CHEMBL3956916
SMILES: CCCc1ccc(cc1)\N=C1/S\C(=C/c2ccncc2)C(=O)N1C
InChI Key: InChIKey=AIVZOPZVIDGDFB-MIZVFFBBSA-N
Data: 1 IC50
Activity Spreadsheet -- Enzyme Inhibition Constant Data from BindingDB
Found 1 hit for monomerid = 50198159
Trg + Lig
Ki
nM
ΔG°
kcal/mole
IC50
nM
Kd
nM
EC50/IC50
nM
koff
s-1
kon
M-1s-1
pHTemp
°C
Aurora kinase A
(Homo sapiens (Human))
BDBM50198159
(CHEMBL3956916)
Show SMILES CCCc1ccc(cc1)\N=C1/S\C(=C/c2ccncc2)C(=O)N1C
Show InChI InChI=1S/C19H19N3OS/c1-3-4-14-5-7-16(8-6-14)21-19-22(2)18(23)17(24-19)13-15-9-11-20-12-10-15/h5-13H,3-4H2,1-2H3/b17-13-,21-19-
NCI pathway
Reactome pathway
n/an/a 1.90E+3n/an/an/an/an/an/a
University of Berne
Curated by ChEMBL
Assay Description
Inhibition of His-tagged human Aurora A kinase (122 to 40 residues) expressed in Escherichia coli BL21 (DE3) Rosetta cells using biotinylated STK2 su...
J Med Chem 59: 7188-211 (2016)
Article DOI: 10.1021/acs.jmedchem.6b00709
BindingDB Entry DOI: 10.7270/Q2JM2CM5