BDBM50198160 CHEMBL3929346
SMILES: CCc1ccccc1\N=C1/S\C(=C/c2ccncc2)C(=O)N1C
InChI Key: InChIKey=PJOKGQUCCQYHEQ-SOBIRXOSSA-N
Data: 1 IC50
Activity Spreadsheet -- Enzyme Inhibition Constant Data from BindingDB
Found 1 hit for monomerid = 50198160
Trg + Lig
Ki
nM
ΔG°
kcal/mole
IC50
nM
Kd
nM
EC50/IC50
nM
koff
s-1
kon
M-1s-1
pHTemp
°C
Aurora kinase A
(Homo sapiens (Human))
BDBM50198160
(CHEMBL3929346)
Show SMILES CCc1ccccc1\N=C1/S\C(=C/c2ccncc2)C(=O)N1C
Show InChI InChI=1S/C18H17N3OS/c1-3-14-6-4-5-7-15(14)20-18-21(2)17(22)16(23-18)12-13-8-10-19-11-9-13/h4-12H,3H2,1-2H3/b16-12-,20-18-
NCI pathway
Reactome pathway
n/an/a 5.20E+4n/an/an/an/an/an/a
University of Berne
Curated by ChEMBL
Assay Description
Inhibition of His-tagged human Aurora A kinase (122 to 40 residues) expressed in Escherichia coli BL21 (DE3) Rosetta cells using biotinylated STK2 su...
J Med Chem 59: 7188-211 (2016)
Article DOI: 10.1021/acs.jmedchem.6b00709
BindingDB Entry DOI: 10.7270/Q2JM2CM5