BDBM50198311 (R)-N-(1-(3-benzyl-7-chloro-4-oxo-3,4-dihydroquinazolin-2-yl)propyl)-4-bromo-N-(3-(dimethylamino)propyl)benzamide::CHEMBL254190
SMILES: CC[C@@H](N(CCCN(C)C)C(=O)c1ccc(Br)cc1)c1nc2cc(Cl)ccc2c(=O)n1Cc1ccccc1
InChI Key: InChIKey=PZVLDHUUSWUATQ-HHHXNRCGSA-N
Data: 5 IC50
Activity Spreadsheet -- Enzyme Inhibition Constant Data from BindingDB
Found 5 hits for monomerid = 50198311
Trg + Lig
Ki
nM
ΔG°
kcal/mole
IC50
nM
Kd
nM
EC50/IC50
nM
koff
s-1
kon
M-1s-1
pHTemp
°C
Kinesin-like protein 1
(Homo sapiens (Human))
BDBM50198311
((R)-N-(1-(3-benzyl-7-chloro-4-oxo-3,4-dihydroquina...)
Show SMILES CC[C@@H](N(CCCN(C)C)C(=O)c1ccc(Br)cc1)c1nc2cc(Cl)ccc2c(=O)n1Cc1ccccc1
Show InChI InChI=1S/C30H32BrClN4O2/c1-4-27(35(18-8-17-34(2)3)29(37)22-11-13-23(31)14-12-22)28-33-26-19-24(32)15-16-25(26)30(38)36(28)20-21-9-6-5-7-10-21/h5-7,9-16,19,27H,4,8,17-18,20H2,1-3H3/t27-/m1/s1
Reactome pathway
n/an/a 49n/an/an/an/an/an/a
China Pharmaceutical University
Curated by ChEMBL
Assay Description
Inhibition of human Eg5 expressed in Escherichia coli assessed as microtubule-activated ATPase activity by spectrophotometry
Bioorg Med Chem 18: 4167-77 (2010)
Article DOI: 10.1016/j.bmc.2010.05.024
BindingDB Entry DOI: 10.7270/Q2BK1CJP
Kinesin-like protein 1
(Homo sapiens (Human))
BDBM50198311
((R)-N-(1-(3-benzyl-7-chloro-4-oxo-3,4-dihydroquina...)
Show SMILES CC[C@@H](N(CCCN(C)C)C(=O)c1ccc(Br)cc1)c1nc2cc(Cl)ccc2c(=O)n1Cc1ccccc1
Show InChI InChI=1S/C30H32BrClN4O2/c1-4-27(35(18-8-17-34(2)3)29(37)22-11-13-23(31)14-12-22)28-33-26-19-24(32)15-16-25(26)30(38)36(28)20-21-9-6-5-7-10-21/h5-7,9-16,19,27H,4,8,17-18,20H2,1-3H3/t27-/m1/s1
Reactome pathway
n/an/a 29n/an/an/an/an/an/a
China Pharmaceutical University
Curated by ChEMBL
Assay Description
Inhibition of human full-length Eg5 ATPase activity expressed in Escherichia coli assessed as release of inorganic phosphate after 30 mins
Bioorg Med Chem 18: 8035-43 (2010)
Article DOI: 10.1016/j.bmc.2010.09.020
BindingDB Entry DOI: 10.7270/Q2BZ668Q
Kinesin-like protein 1
(Homo sapiens (Human))
BDBM50198311
((R)-N-(1-(3-benzyl-7-chloro-4-oxo-3,4-dihydroquina...)
Show SMILES CC[C@@H](N(CCCN(C)C)C(=O)c1ccc(Br)cc1)c1nc2cc(Cl)ccc2c(=O)n1Cc1ccccc1
Show InChI InChI=1S/C30H32BrClN4O2/c1-4-27(35(18-8-17-34(2)3)29(37)22-11-13-23(31)14-12-22)28-33-26-19-24(32)15-16-25(26)30(38)36(28)20-21-9-6-5-7-10-21/h5-7,9-16,19,27H,4,8,17-18,20H2,1-3H3/t27-/m1/s1
Reactome pathway
n/an/a 12n/an/an/an/an/an/a
China Pharmaceutical University
Curated by ChEMBL
Assay Description
Inhibition of KSP
Bioorg Med Chem Lett 17: 722-6 (2007)
Article DOI: 10.1016/j.bmcl.2006.10.083
BindingDB Entry DOI: 10.7270/Q2HT2Q4S
Kinesin-like protein 1
(Homo sapiens (Human))
BDBM50198311
((R)-N-(1-(3-benzyl-7-chloro-4-oxo-3,4-dihydroquina...)
Show SMILES CC[C@@H](N(CCCN(C)C)C(=O)c1ccc(Br)cc1)c1nc2cc(Cl)ccc2c(=O)n1Cc1ccccc1
Show InChI InChI=1S/C30H32BrClN4O2/c1-4-27(35(18-8-17-34(2)3)29(37)22-11-13-23(31)14-12-22)28-33-26-19-24(32)15-16-25(26)30(38)36(28)20-21-9-6-5-7-10-21/h5-7,9-16,19,27H,4,8,17-18,20H2,1-3H3/t27-/m1/s1
Reactome pathway
n/an/a 53n/an/an/an/an/an/a
China Pharmaceutical University
Curated by ChEMBL
Assay Description
Inhibition of human ATPase activity KSP expressed in Escherichia coli after 30 mins by spectrophotometric analysis
Bioorg Med Chem 19: 5612-27 (2011)
Article DOI: 10.1016/j.bmc.2011.07.029
BindingDB Entry DOI: 10.7270/Q2B858HD
Aurora kinase A
(Homo sapiens (Human))
BDBM50198311
((R)-N-(1-(3-benzyl-7-chloro-4-oxo-3,4-dihydroquina...)
Show SMILES CC[C@@H](N(CCCN(C)C)C(=O)c1ccc(Br)cc1)c1nc2cc(Cl)ccc2c(=O)n1Cc1ccccc1
Show InChI InChI=1S/C30H32BrClN4O2/c1-4-27(35(18-8-17-34(2)3)29(37)22-11-13-23(31)14-12-22)28-33-26-19-24(32)15-16-25(26)30(38)36(28)20-21-9-6-5-7-10-21/h5-7,9-16,19,27H,4,8,17-18,20H2,1-3H3/t27-/m1/s1
NCI pathway
Reactome pathway
n/an/a>5.00E+4n/an/an/an/an/an/a
China Pharmaceutical University
Curated by ChEMBL
Assay Description
Inhibition of human purified recombinant aurora-A kinase
Bioorg Med Chem 18: 8035-43 (2010)
Article DOI: 10.1016/j.bmc.2010.09.020
BindingDB Entry DOI: 10.7270/Q2BZ668Q