BDBM50198627 CHEMBL3969106
SMILES: COc1cc(\C=C\C(=O)CC(=O)\C=C\c2cc(O)ccc2OC)ccc1O
InChI Key: InChIKey=MVTKRBVRYILFSG-SNCPXTGUSA-N
Data: 1 IC50
Activity Spreadsheet -- Enzyme Inhibition Constant Data from BindingDB
Found 1 hit for monomerid = 50198627
Trg + Lig
Ki
nM
ΔG°
kcal/mole
IC50
nM
Kd
nM
EC50/IC50
nM
koff
s-1
kon
M-1s-1
pHTemp
°C
Tau
(Homo sapiens (Human))
BDBM50198627
(CHEMBL3969106)
Show SMILES COc1cc(\C=C\C(=O)CC(=O)\C=C\c2cc(O)ccc2OC)ccc1O
Show InChI InChI=1S/C21H20O6/c1-26-20-10-8-16(22)12-15(20)5-7-18(24)13-17(23)6-3-14-4-9-19(25)21(11-14)27-2/h3-12,22,25H,13H2,1-2H3/b6-3+,7-5+
n/an/a 600n/an/an/an/an/an/a
Doshisha University
Curated by ChEMBL
Assay Description
Inhibition of recombinant human TAU three-repeat microtubule-binding domain aggregation expressed in Escherichia coli after 16 hrs by thioflavin T fl...
Bioorg Med Chem Lett 26: 5024-5028 (2016)
Article DOI: 10.1016/j.bmcl.2016.08.092
BindingDB Entry DOI: 10.7270/Q2833V0M