BDBM50198689 CHEMBL3938215
SMILES: C[C@@H](NC(=O)c1nn(c2c1CCCC\C2=C/c1ccc(Cl)s1)-c1ccc(cc1Cl)C(F)(F)F)c1ccccn1
InChI Key: InChIKey=AIOQZVVKJGWGOM-WECAROLCSA-N
Data: 2 EC50
Activity Spreadsheet -- Enzyme Inhibition Constant Data from BindingDB
Found 2 hits for monomerid = 50198689
Trg + Lig
Ki
nM
ΔG°
kcal/mole
IC50
nM
Kd
nM
EC50/IC50
nM
koff
s-1
kon
M-1s-1
pHTemp
°C
Cannabinoid receptor 2
(Homo sapiens (Human))
BDBM50198689
(CHEMBL3938215)
Show SMILES C[C@@H](NC(=O)c1nn(c2c1CCCC\C2=C/c1ccc(Cl)s1)-c1ccc(cc1Cl)C(F)(F)F)c1ccccn1 |r|
Show InChI InChI=1S/C28H23Cl2F3N4OS/c1-16(22-8-4-5-13-34-22)35-27(38)25-20-7-3-2-6-17(14-19-10-12-24(30)39-19)26(20)37(36-25)23-11-9-18(15-21(23)29)28(31,32)33/h4-5,8-16H,2-3,6-7H2,1H3,(H,35,38)/b17-14+/t16-/m1/s1
Reactome pathway
n/an/an/an/a>1.00E+4n/an/an/an/a
Janssen Research& Development, L.L.C.
Curated by ChEMBL
Assay Description
Inverse agonist activity at human cannabinoid receptor 2 expressed in HEK293 cells assessed as increase in forskolin-induced cAMP production preincub...
Bioorg Med Chem Lett 26: 5346-5349 (2016)
Article DOI: 10.1016/j.bmcl.2016.09.025
BindingDB Entry DOI: 10.7270/Q2MC9207
Cannabinoid receptor 1
(Homo sapiens (Human))
BDBM50198689
(CHEMBL3938215)
Show SMILES C[C@@H](NC(=O)c1nn(c2c1CCCC\C2=C/c1ccc(Cl)s1)-c1ccc(cc1Cl)C(F)(F)F)c1ccccn1 |r|
Show InChI InChI=1S/C28H23Cl2F3N4OS/c1-16(22-8-4-5-13-34-22)35-27(38)25-20-7-3-2-6-17(14-19-10-12-24(30)39-19)26(20)37(36-25)23-11-9-18(15-21(23)29)28(31,32)33/h4-5,8-16H,2-3,6-7H2,1H3,(H,35,38)/b17-14+/t16-/m1/s1
NCI pathway
Reactome pathway
n/an/an/an/a 8n/an/an/an/a
Janssen Research& Development, L.L.C.
Curated by ChEMBL
Assay Description
Inverse agonist activity at human cannabinoid receptor 1 expressed in HEK293 cells assessed as increase in forskolin-induced cAMP production preincub...
Bioorg Med Chem Lett 26: 5346-5349 (2016)
Article DOI: 10.1016/j.bmcl.2016.09.025
BindingDB Entry DOI: 10.7270/Q2MC9207