BDBM50198697 CHEMBL3966803
SMILES: C[C@@H](NC(=O)c1nn(c2c1CCC\C2=C/c1ccc(Cl)cn1)-c1ccc(Cl)cc1)c1ccccn1
InChI Key: InChIKey=GKAXOANONMZCFR-PQMNFKMDSA-N
Data: 2 EC50
Activity Spreadsheet -- Enzyme Inhibition Constant Data from BindingDB
Found 2 hits for monomerid = 50198697
Trg + Lig
Ki
nM
ΔG°
kcal/mole
IC50
nM
Kd
nM
EC50/IC50
nM
koff
s-1
kon
M-1s-1
pHTemp
°C
Cannabinoid receptor 2
(Homo sapiens (Human))
BDBM50198697
(CHEMBL3966803)
Show SMILES C[C@@H](NC(=O)c1nn(c2c1CCC\C2=C/c1ccc(Cl)cn1)-c1ccc(Cl)cc1)c1ccccn1 |r|
Show InChI InChI=1S/C27H23Cl2N5O/c1-17(24-7-2-3-14-30-24)32-27(35)25-23-6-4-5-18(15-21-11-8-20(29)16-31-21)26(23)34(33-25)22-12-9-19(28)10-13-22/h2-3,7-17H,4-6H2,1H3,(H,32,35)/b18-15+/t17-/m1/s1
Reactome pathway
n/an/an/an/a>1.00E+4n/an/an/an/a
Janssen Research& Development, L.L.C.
Curated by ChEMBL
Assay Description
Inverse agonist activity at human cannabinoid receptor 2 expressed in HEK293 cells assessed as increase in forskolin-induced cAMP production preincub...
Bioorg Med Chem Lett 26: 5346-5349 (2016)
Article DOI: 10.1016/j.bmcl.2016.09.025
BindingDB Entry DOI: 10.7270/Q2MC9207
Cannabinoid receptor 1
(Homo sapiens (Human))
BDBM50198697
(CHEMBL3966803)
Show SMILES C[C@@H](NC(=O)c1nn(c2c1CCC\C2=C/c1ccc(Cl)cn1)-c1ccc(Cl)cc1)c1ccccn1 |r|
Show InChI InChI=1S/C27H23Cl2N5O/c1-17(24-7-2-3-14-30-24)32-27(35)25-23-6-4-5-18(15-21-11-8-20(29)16-31-21)26(23)34(33-25)22-12-9-19(28)10-13-22/h2-3,7-17H,4-6H2,1H3,(H,32,35)/b18-15+/t17-/m1/s1
NCI pathway
Reactome pathway
n/an/an/an/a 22n/an/an/an/a
Janssen Research& Development, L.L.C.
Curated by ChEMBL
Assay Description
Inverse agonist activity at human cannabinoid receptor 1 expressed in HEK293 cells assessed as increase in forskolin-induced cAMP production preincub...
Bioorg Med Chem Lett 26: 5346-5349 (2016)
Article DOI: 10.1016/j.bmcl.2016.09.025
BindingDB Entry DOI: 10.7270/Q2MC9207